{"text_format":"1","workbook":"xlsx","n_sheets":7,"sheets":["Quick Start","Calculator","Frequency Response","Sine Wave","c","Notes and Instructions","Info"],"not_rendered":{"charts":8,"images":134,"macros":1,"external_links":0,"defined_names":0,"comments":1,"pivot_tables":0},"unopened":[],"bounds":{"document_bytes":16777216,"sheet_cells":100000,"rows_first":2000,"rows_last":500,"rows_between":2000,"halvings":0,"cell_chars":16384,"cell_head_chars":4096},"cells_cut":0,"cells_raw":0,"read":"whole","date_system":"1900"}

{"sheet":"Quick Start","index":0,"n_rows":39,"n_cols":27,"rows_kept":39,"cut":false,"hidden":false,"merged":[[21,5,21,7],[22,5,22,7],[23,5,23,7],[24,5,24,7],[32,2,33,4],[11,5,11,7],[11,1,11,4],[23,1,23,2],[12,5,12,7],[13,5,13,7],[14,5,14,7],[15,5,15,7],[16,5,16,7],[17,5,17,7],[18,5,18,7],[19,5,19,7],[20,5,20,7]]}
[null,null,null,null,null,null,null,null,null,null,null,null,null,null,null,null,null,null,null,null,null,null,null,null,null,"feet"]
[null,null,null,null,null,null,null,null,null,null,null,null,null,null,null,null,null,null,null,null,null,null,null,null,null,1]
[null,null,null,null,null,null,null,null,null,null,null,null,null,null,null,null,null,null,null,null,null,null,null,null,null,1]
[null,null,null,null,null,null,null,null,null,null,null,null,null,null,null,null,null,null,null,null,null,null,null,null,null,4]
[null,null,null,null,null,null,null,null,null,null,null,null,null,null,null,null,null,null,null,null,null,null,null,null,null,false]
[null,null,null,null,null,null,null,null,null,null,null,null,null,null,null,null,null,null,null,null,null,null,null,null,null,50]
[null,null,null,null,null,null,null,null,null,null,null,null,null,null,null,null,null,null,null,null,null,null,null,null,null,{"$f":"($Z$6*2/100)","v":1}]
[null,null,null,null,null,null,null,null,null,null,null,null,null,null,null,null,null,null,null,null,null,null,null,null,null,{"$f":"IF(AND(Z4=2,Z3=3),2,IF(AND(Z4=4,Z3=3),1.04,IF(Z3=2,1.165,1)))","v":1}]
[null,"DSP Setting Prediction",null,null,null,null,null,null,null,null,null,null,null,null,null,null,null,null,null,null,null,null,null,null,null,141.01453340768637]
[null,"v1.3",null,null,null,null,null,null,null,null,null,null,null,null,null,null,null,null,null,null,null,null,null,null,null,null,"->empty"]
[]
[null,"DATA INPUT"]
[null,"Steered Bass Array Option",null,null,null,"Community VLF Presets"]
[null,"Unit",null,null,null,"Using One VLF Steered Array Bracket"]
[null,"Temperature",70,{"$f":"IF(Z1=\"feet\",\"F\",IF(Z1=\"meter\",\"C\",\"---\"))","v":"F"}]
[null,"Speed of Sound",{"$f":"IF(Z1=\"feet\",49.03*SQRT(459.4+C15),IF(Z1=\"meter\",20.05*SQRT(273+C15),\"---\"))","v":1128.116267261491},{"$f":"IF(Z1=\"feet\",\"ft/s\",IF(Z1=\"meter\",\"m/s\",\"---\"))","v":"ft/s"}]
[null,"Loudspeakers Quantity:"]
[null,"Select one design guide:",null,null,null,"Using Two VLF Steered Array Bracket"]
[null,null,null,24,{"$f":"IF(Z1=\"feet\",\"in\",IF(Z1=\"meter\",\"cm\",\"---\"))","v":"in"}]
[null,null,null,{"$f":"$C$32","v":84.608720044611815},"Hz"]
[null,null,null,{"$f":"IF(D20=\"---\",\"\",IF(D20>600,\"Too High\",\"\"))","v":""}]
[null,"Over-Delay Adjustment",{"$f":"$Z$7-1","v":0},null,{"$f":"IF(Z5=FALSE,\"No\",\"Yes\")","v":"No"},"Using Three VLF Steered Array Bracket"]
[null,null,1.7728669092371232]
[null,"Freq of Max Rear Attenuation +/-",null,70.507266703843186,"Hz"]
[null,null,null,null,null,"Using Four VLF Steered Array Bracket"]
[null,"Polar Pattern"]
[]
[]
[]
[]
[]
[null,null,{"$f":"IF(AND($Z$2=1,$Z$1=\"feet\"),0.6*$Z$8*$C$16/($Z$4*$D$19/12),IF(AND($Z$2=1,$Z$1=\"meter\"),0.6*$Z$8*$C$16/($Z$4*$D$19/100),IF(AND($Z$2=2,$Z$1=\"feet\"),(($C$16*12)/($Z$4*$D$20/($Z$8*0.6))),IF(AND($Z$2=2,$Z$1=\"meter\"),(($C$16*100)/($Z$4*$D$20/(0.6*$Z$8))),\"\"))))","v":84.608720044611815}]
[null,null,"Steered Bass Array Info"]
[]
[]
[null,"Informational Article"]
[null,"Calculator Spreadsheet"]
[null,"Frequency Response Spreadsheet"]
[null,"Notes and Instructions"]

{"sheet":"Calculator","index":1,"n_rows":92,"n_cols":28,"rows_kept":92,"cut":false,"hidden":false,"merged":[[19,3,19,5],[19,1,20,1],[19,7,20,7]]}
[null,null,null,null,null,null,null,null,null,null,null,null,null,null,null,null,null,null,null,null,null,null,null,null,null,"feet",null,0]
[null,null,null,null,null,null,null,null,null,null,null,null,null,null,null,null,null,null,null,null,null,null,null,null,null,5,null,{"$f":"AB1+15","v":15}]
[null,null,null,null,null,null,null,null,null,null,null,null,null,null,null,null,null,null,null,null,null,null,null,null,null,50,null,{"$f":"AB2+15","v":30}]
[null,null,null,null,null,null,null,null,null,null,null,null,null,null,null,null,null,null,null,null,null,null,null,null,null,6,null,45]
[null,null,null,null,null,null,null,null,null,null,null,null,null,null,null,null,null,null,null,null,null,null,null,null,null,1,null,60]
[null,null,null,null,null,null,null,null,null,null,null,null,null,null,null,null,null,null,null,null,null,null,null,null,null,null,"->empty",75]
[null,null,null,null,null,null,null,null,null,null,null,null,null,null,null,null,null,null,null,null,null,null,null,null,null,null,null,90]
[null,"2D Polar Prediction for Multiple Point Sources",null,null,null,null,null,null,null,null,null,null,null,null,null,null,null,null,null,null,null,null,null,null,null,null,null,105]
[null,"v1.3",null,null,null,null,null,null,null,null,null,null,null,null,null,null,null,null,null,null,null,null,null,null,null,null,null,120]
[null,null,null,null,null,null,null,null,null,null,null,null,null,null,null,null,null,null,null,null,null,null,null,null,null,null,null,135]
[null,null,null,null,null,null,null,null,null,null,null,null,null,null,null,null,null,null,null,null,null,null,null,null,null,null,null,150]
[null,"Data Input",null,null,null,null,null,null,null,null,null,null,null,null,null,null,null,null,null,null,null,null,null,null,null,null,null,165]
[null,"Unit",null,null,null,null,null,"Calculation Accuracy",null,null,null,null,null,null,null,null,null,null,null,null,null,null,null,null,null,null,null,180]
[null,"Speed of Sound (air propagation)",1128.116267261491,{"$f":"IF($Z$1=\"feet\",\"ft/s\", IF($Z$1=\"meters\", \"m/s\",\"--\"))","v":"ft/s"},null,null,null,"Polar Result Parameters:",null,null,null,null,null,null,null,null,null,null,null,null,null,null,null,null,null,null,null,195]
[null,"Distance to Listener/Microphone",40,{"$f":"Z1","v":"feet"},{"$f":"IF(C15=0,\"ERROR\",IF(AND(Z1=\"feet\", C15<15), \"Too close\", IF(AND(Z1=\"meters\",C15<5),\"Too close\",\"\")))","v":""},null,null,"Graph Range",null,null,null,null,null,{"$f":"Z3","v":50},"dB",null,null,null,null,null,null,null,null,null,null,null,null,210]
[null,"Point of Origin (X)",0,{"$f":"Z1","v":"feet"},{"$f":"IF($Z$1=\"feet\",$C$16*12, IF($Z$1=\"meters\", $C$16*100,\"--\"))","v":0},{"$f":"IF(Z1=\"feet\",\"inch(es)\",IF(Z1=\"meters\",\"cm\",\"--\"))","v":"inch(es)"},null,"Graph Scale",null,null,null,null,null,null,null,null,null,null,null,null,null,null,null,null,null,null,null,225]
[null,"Point of Origin (Y)",0,{"$f":"Z1","v":"feet"},{"$f":"IF($Z$1=\"feet\",$C$17*12, IF($Z$1=\"meters\", $C$17*100,\"--\"))","v":0},{"$f":"IF(Z1=\"feet\",\"inch(es)\",IF(Z1=\"meters\",\"cm\",\"--\"))","v":"inch(es)"},null,null,null,null,null,null,null,null,null,null,null,null,null,null,null,null,null,null,null,null,null,240]
[null,"Point of Origin (Z)",0,{"$f":"Z1","v":"feet"},{"$f":"IF($Z$1=\"feet\",$C$18*12, IF($Z$1=\"meters\", $C$18*100,\"--\"))","v":0},{"$f":"IF(Z1=\"feet\",\"inch(es)\",IF(Z1=\"meters\",\"cm\",\"--\"))","v":"inch(es)"},null,"Graph View/Polar Axis",null,null,null,null,null,null,null,null,null,null,null,null,null,null,null,null,null,null,null,255]
[null,null,null,null,null,null,null,null,null,null,null,null,null,null,null,null,null,null,null,null,null,null,null,null,null,null,null,{"$f":"AB18+15","v":270}]
[null,"Sound Sources","Phase shift",{"$f":"IF(Z1=\"feet\",\"Position (in)\",IF(Z1=\"meters\",\"Position (cm)\",\"--\"))","v":"Position (in)"},null,null,"Polarity","Delay (ms)","Attenuation",null,"Result",null,null,null,null,{"$f":"O32","v":"Y"},null,null,null,null,null,null,null,null,null,null,null,285]
[null,null,"(deg)","x","y","z","+/-",null,"(dB)",null,null,null,null,null,null,null,null,null,null,null,null,null,null,null,null,null,null,300]
[null,"Point Source 1",0,0,0,0,null,0,0,null,null,null,null,null,null,null,null,null,null,null,null,null,null,null,null,null,null,315]
[null,"Point Source 2",0,0,0,0,null,0,0,null,null,null,null,null,null,null,null,null,null,null,null,null,null,null,null,null,null,330]
[null,"Point Source 3",0,0,0,0,null,0,0,null,{"$f":"R32","v":"X"},null,null,null,null,null,null,null,null,null,null,null,null,null,null,null,null,345]
[null,"Point Source 4",0,0,0,0,null,0,0]
[null,"Point Source 5",0,0,0,0,null,0,0]
[null,"Point Source 6",0,0,0,0,null,0,0]
[null,"Point Source 7",0,0,0,0,null,0,0]
[null,"Point Source 8",0,0,0,0,null,0,0]
[null,"Point Source 9",0,0,0,0,null,0,0]
[null,"Point Source 10",0,0,0,0,null,0,0]
[null,null,null,null,null,null,null,null,null,null,null,null,"Horizontal Axis:",null,{"$f":"IF(Z5=1,\"Y\",IF(Z5=2,\"Z\",IF(Z5=3,\"Z\",\"\")))","v":"Y"},"Vertical  Axis:",null,{"$f":"IF(Z5=1,\"X\",IF(Z5=2,\"Y\",IF(Z5=3,\"X\",\"\")))","v":"X"},null,null,"Positions of point sources from the table"]
[null,"Frequency Selection (10-2000Hz)",null,null,null,null,null,{"$f":"IF(C34<1,\"ERROR!!\",\"\")","v":""}]
[null,"Frequency to graph",100,"Hz","Average",null,null,{"$f":"IF(Z4=0,0,1/Z4)","v":0.16666666666666666},"Octave"]
[null,null,null,null,"Upper Frequency Limit",null,null,{"$f":"$C$34 * (2 ^ ($H$34 / 2))","v":105.94630943592954},"Hz"]
[null,null,null,null,"Lower Frequency Limit",null,null,{"$f":"$C$34 * (2 ^ (-1*($H$34 / 2)))","v":94.387431268169337},"Hz"]
[]
[]
[null,"Calculate Multiple Frequencies"]
[null,"Informational Article"]
[null,"Frequency Response Spreadsheet"]
[null,"Quick Start Spreadsheet"]
[null,"Notes and Instructions"]
[]
[]
[]
[]
[]
[]
[]
[]
[]
[]
[]
[]
[]
[]
[]
[]
[]
[null,"Polar A Control Panel",null,"Polar A",null,null,null,null,null,null,null,null,null,null,"Polar B"]
[null,"Frequencies to graph:"]
[null,100,"Hz"]
[null,100,"Hz"]
[null,100,"Hz"]
[]
[]
[]
[]
[]
[]
[]
[null,"Polar B Control Panel"]
[]
[null,"Frequencies to graph:"]
[null,100,"Hz"]
[null,100,"Hz"]
[null,100,"Hz"]
[]
[]
[]
[]
[]
[null,"Note on Calculate Frequency Button:"]
[null,"1. This function relies on Average (bandwidth)"]
[null,"slider and frequency input in the calculator above."]
[null,"2. Input values and results in Polar A and Polar B"]
[null,"does not have any connections."]
[]
[]
[]
[null,"Return to Top"]

{"sheet":"Frequency Response","index":2,"n_rows":55,"n_cols":54,"rows_kept":55,"cut":false,"hidden":false,"merged":[]}
[null,null,null,null,null,null,null,null,null,null,null,null,null,null,null,null,null,null,null,null,null,null,null,null,null,true,null,null,null,null,null,null,null,null,null,null,null,null,null,null,null,null,null,null,null,null,null,null,null,null,null,null,null,20]
[null,null,null,null,null,null,null,null,null,null,null,null,null,null,null,null,null,null,null,null,null,null,null,null,null,2,null,null,null,null,null,null,null,null,null,null,null,null,null,null,null,null,null,null,null,null,null,null,null,null,null,null,null,20]
[]
[]
[]
[]
[]
[]
[]
[null,"Frequency and Phase Response Calculator"]
[null,"v1.3"]
[]
[null,"Note: This Spreadsheet utilized the data from 2D Polar Prediction for Multiple Point Sources spreadsheet"]
[]
[null,"Data Input"]
[null,"Listener Position (X)",30,{"$f":"Calculator!$Z$1","v":"feet"}]
[null,"Listener Position (Y)",0,{"$f":"Calculator!$Z$1","v":"feet"}]
[null,"Listener Position (Z)",0,{"$f":"Calculator!$Z$1","v":"feet"}]
[null,"Smoothing","NONE"]
[null,"Number of Samples",128]
[null,"Sample Rate",{"$f":"C22*2","v":1000}]
[null,"Max Frequency to Plot",500,"Hz"]
[null,"Frequency Resolution",{"$f":"C21/C20","v":7.8125},"Hz"]
[null,"Inverse Square Law",null,{"$f":"IF(Z1=TRUE,\"Yes**\",\"No**\")","v":"Yes**"}]
[null,"Phase Response Reference Distance:"]
[]
[]
[]
[]
[]
[]
[]
[null,{"$f":"IF(Z1=TRUE,\"**Inverse Square Law will result in error if one of the source location is too close to the listener\",\"**Inverse Square law is not included, listener should be in farfield\")","v":"**Inverse Square Law will result in error if one of the source location is too close to the listener"}]
[]
[]
[null,"Informational Article"]
[null,"Calculator Spreadsheet"]
[null,"Quick Start Spreadsheet"]
[null,"Notes and Instructions"]
[]
[]
[]
[]
[]
[]
[]
[]
[]
[]
[]
[]
[]
[]
[null,null,null,null,null,"Number of Samples (DFT):"]
[null,null,null,null,null,{"$f":"IF($C$20=256,\"Calculation time may exceed 20sec\",IF($C$20=512,\"Calculation time may exceed 1min\",\"\"))","v":""}]

{"sheet":"Sine Wave","index":3,"n_rows":362,"n_cols":26,"rows_kept":362,"cut":false,"hidden":true,"merged":[]}
["Sine Wave Graph Tool",null,null,null,null,null,null,null,null,null,null,null,null,null,null,null,"Phase Shift (rad)",{"$f":"D5*(PI())/180","v":0},null,null,"X","Time","Y","Y2",null,"X axis"]
["Graph is limited to one period of the wave",null,null,null,null,null,null,null,null,null,null,null,null,null,null,null,"Periode (ms)",{"$f":"1/D4","v":0.01},null,null,0,{"$f":"(U2/360)*R$2","v":0},{"$f":"SIN((((2*PI())*$D$4)*($V2-($D$6/1000)))+$R$1)","v":0},{"$f":"SIN((((2*PI())*$F$4)*($V2-($F$6/1000)))+$R$3)","v":0},null,{"$f":"1000*($U2/360)*$R$2","v":0}]
["Fill in the green boxes",null,null,null,null,null,null,null,null,null,null,null,null,null,null,null,"Phase Shift (rad) #2",{"$f":"F5*(PI())/180","v":0},null,null,1,{"$f":"(U3/360)*R$2","v":2.7777777777777779E-5},{"$f":"SIN((((2*PI())*$D$4)*($V3-($D$6/1000)))+$R$1)","v":1.7452406437283512E-2},{"$f":"SIN((((2*PI())*$F$4)*($V3-($F$6/1000)))+$R$3)","v":1.7452406437283512E-2},null,{"$f":"1000*($U3/360)*$R$2","v":2.7777777777777776E-2}]
[null,null,"Frequency",100,"Hz",100,"Hz",null,null,null,null,null,null,null,null,null,"Periode (ms) #2",{"$f":"1/F4","v":0.01},null,null,{"$f":"U3+1","v":2},5.5555555555555558E-5,3.4899496702500969E-2,3.4899496702500969E-2,null,5.5555555555555552E-2]
[null,null,"Phase Shift",0,"deg",0,"deg",null,null,null,null,null,null,null,null,null,null,null,null,null,{"$f":"U4+1","v":3},8.3333333333333331E-5,5.2335956242943828E-2,5.2335956242943828E-2,null,8.3333333333333343E-2]
[null,null,"Delay",0,"ms",0,"ms",null,null,null,null,null,null,null,null,null,null,null,null,null,4,1.1111111111111112E-4,6.9756473744125302E-2,6.9756473744125302E-2,null,0.1111111111111111]
[null,null,null,1,null,2,null,null,null,null,null,null,null,null,null,null,null,null,null,null,5,1.3888888888888889E-4,8.7155742747658166E-2,8.7155742747658166E-2,null,0.13888888888888887]
[null,null,null,null,null,null,null,null,null,null,null,null,null,null,null,null,null,null,null,null,6,1.6666666666666666E-4,0.10452846326765346,0.10452846326765346,null,0.16666666666666669]
[null,null,"Note: Graph Axis is determined by the first sine wave input",null,null,null,null,null,null,null,null,null,null,null,null,null,null,null,null,null,7,1.9444444444444446E-4,0.12186934340514749,0.12186934340514749,null,0.19444444444444448]
[null,null,null,null,null,null,null,null,null,null,null,null,null,null,null,null,null,null,null,null,8,2.2222222222222223E-4,0.13917310096006544,0.13917310096006544,null,0.22222222222222221]
[null,null,null,null,null,null,null,null,null,null,null,null,null,null,null,null,null,null,null,null,9,2.5000000000000001E-4,0.15643446504023087,0.15643446504023087,null,0.25]
[null,null,null,null,null,null,null,null,null,null,null,null,null,null,null,null,null,null,null,null,10,2.7777777777777778E-4,0.17364817766693033,0.17364817766693033,null,0.27777777777777773]
[null,null,null,null,null,null,null,null,null,null,null,null,null,null,null,null,null,null,null,null,11,3.0555555555555555E-4,0.1908089953765448,0.1908089953765448,null,0.30555555555555552]
[null,null,null,null,null,null,null,null,null,null,null,null,null,null,null,null,null,null,null,null,12,3.3333333333333332E-4,0.20791169081775931,0.20791169081775931,null,0.33333333333333337]
[null,null,null,null,null,null,null,null,null,null,null,null,null,null,null,null,null,null,null,null,13,3.6111111111111109E-4,0.22495105434386498,0.22495105434386498,null,0.3611111111111111]
[null,null,null,null,null,null,null,null,null,null,null,null,null,null,null,null,null,null,null,null,14,3.8888888888888892E-4,0.24192189559966776,0.24192189559966776,null,0.38888888888888895]
[null,null,null,null,null,null,null,null,null,null,null,null,null,null,null,null,null,null,null,null,15,4.1666666666666664E-4,0.25881904510252074,0.25881904510252074,null,0.41666666666666663]
[null,null,null,null,null,null,null,null,null,null,null,null,null,null,null,null,null,null,null,null,16,4.4444444444444447E-4,0.27563735581699916,0.27563735581699916,null,0.44444444444444442]
[null,null,null,null,null,null,null,null,null,null,null,null,null,null,null,null,null,null,null,null,17,4.7222222222222224E-4,0.29237170472273677,0.29237170472273677,null,0.47222222222222221]
[null,null,null,null,null,null,null,null,null,null,null,null,null,null,null,null,null,null,null,null,18,5.0000000000000001E-4,0.3090169943749474,0.3090169943749474,null,0.5]
[null,null,null,null,null,null,null,null,null,null,null,null,null,null,null,null,null,null,null,null,19,5.2777777777777784E-4,0.3255681544571567,0.3255681544571567,null,0.52777777777777779]
[null,null,null,null,null,null,null,null,null,null,null,null,null,null,null,null,null,null,null,null,20,5.5555555555555556E-4,0.34202014332566871,0.34202014332566871,null,0.55555555555555547]
[null,null,null,null,null,null,null,null,null,null,null,null,null,null,null,null,null,null,null,null,21,5.8333333333333338E-4,0.35836794954530032,0.35836794954530032,null,0.58333333333333337]
[null,null,null,null,null,null,null,null,null,null,null,null,null,null,null,null,null,null,null,null,22,6.111111111111111E-4,0.37460659341591201,0.37460659341591201,null,0.61111111111111105]
[null,null,null,null,null,null,null,null,null,null,null,null,null,null,null,null,null,null,null,null,23,6.3888888888888882E-4,0.39073112848927372,0.39073112848927372,null,0.63888888888888884]
[null,null,null,null,null,null,null,null,null,null,null,null,null,null,null,null,null,null,null,null,24,6.6666666666666664E-4,0.40673664307580015,0.40673664307580015,null,0.66666666666666674]
[null,null,null,null,null,null,null,null,null,null,null,null,null,null,null,null,null,null,null,null,25,6.9444444444444447E-4,0.4226182617406995,0.4226182617406995,null,0.69444444444444442]
[null,null,null,null,null,null,null,null,null,null,null,null,null,null,null,null,null,null,null,null,26,7.2222222222222219E-4,0.4383711467890774,0.4383711467890774,null,0.72222222222222221]
[null,null,null,null,null,null,null,null,null,null,null,null,null,null,null,null,null,null,null,null,27,7.5000000000000002E-4,0.4539904997395468,0.4539904997395468,null,0.75]
[null,null,null,null,null,null,null,null,null,null,null,null,null,null,null,null,null,null,null,null,28,7.7777777777777784E-4,0.46947156278589081,0.46947156278589081,null,0.7777777777777779]
[null,null,null,null,null,null,null,null,null,null,null,null,null,null,null,null,null,null,null,null,29,8.0555555555555567E-4,0.48480962024633706,0.48480962024633706,null,0.80555555555555558]
[null,null,null,null,null,null,null,null,null,null,null,null,null,null,null,null,null,null,null,null,30,8.3333333333333328E-4,0.49999999999999994,0.49999999999999994,null,0.83333333333333326]
[null,null,null,null,null,null,null,null,null,null,null,null,null,null,null,null,null,null,null,null,31,8.611111111111111E-4,0.51503807491005416,0.51503807491005416,null,0.86111111111111116]
[null,null,null,null,null,null,null,null,null,null,null,null,null,null,null,null,null,null,null,null,32,8.8888888888888893E-4,0.5299192642332049,0.5299192642332049,null,0.88888888888888884]
[null,null,null,null,null,null,null,null,null,null,null,null,null,null,null,null,null,null,null,null,33,9.1666666666666665E-4,0.54463903501502708,0.54463903501502708,null,0.91666666666666663]
[null,null,null,null,null,null,null,null,null,null,null,null,null,null,null,null,null,null,null,null,34,9.4444444444444448E-4,0.5591929034707469,0.5591929034707469,null,0.94444444444444442]
[null,null,null,null,null,null,null,null,null,null,null,null,null,null,null,null,null,null,null,null,35,9.722222222222223E-4,0.57357643635104616,0.57357643635104616,null,0.97222222222222232]
[null,null,null,null,null,null,null,null,null,null,null,null,null,null,null,null,null,null,null,null,36,1E-3,0.58778525229247314,0.58778525229247314,null,1]
[null,null,null,null,null,null,null,null,null,null,null,null,null,null,null,null,null,null,null,null,37,1.0277777777777778E-3,0.60181502315204827,0.60181502315204827,null,1.0277777777777777]
[null,null,null,null,null,null,null,null,null,null,null,null,null,null,null,null,null,null,null,null,38,1.0555555555555557E-3,0.61566147532565829,0.61566147532565829,null,1.0555555555555556]
[null,null,null,null,null,null,null,null,null,null,null,null,null,null,null,null,null,null,null,null,39,1.0833333333333335E-3,0.62932039104983761,0.62932039104983761,null,1.0833333333333335]
[null,null,null,null,null,null,null,null,null,null,null,null,null,null,null,null,null,null,null,null,40,1.1111111111111111E-3,0.64278760968653925,0.64278760968653925,null,1.1111111111111109]
[null,null,null,null,null,null,null,null,null,null,null,null,null,null,null,null,null,null,null,null,41,1.1388888888888889E-3,0.65605902899050728,0.65605902899050728,null,1.1388888888888888]
[null,null,null,null,null,null,null,null,null,null,null,null,null,null,null,null,null,null,null,null,42,1.1666666666666668E-3,0.66913060635885835,0.66913060635885835,null,1.1666666666666667]
[null,null,null,null,null,null,null,null,null,null,null,null,null,null,null,null,null,null,null,null,43,1.1944444444444446E-3,0.68199836006249859,0.68199836006249859,null,1.1944444444444446]
[null,null,null,null,null,null,null,null,null,null,null,null,null,null,null,null,null,null,null,null,44,1.2222222222222222E-3,0.69465837045899725,0.69465837045899725,null,1.2222222222222221]
[null,null,null,null,null,null,null,null,null,null,null,null,null,null,null,null,null,null,null,null,45,1.25E-3,0.70710678118654746,0.70710678118654746,null,1.25]
[null,null,null,null,null,null,null,null,null,null,null,null,null,null,null,null,null,null,null,null,46,1.2777777777777776E-3,0.71933980033865108,0.71933980033865108,null,1.2777777777777777]
[null,null,null,null,null,null,null,null,null,null,null,null,null,null,null,null,null,null,null,null,47,1.3055555555555557E-3,0.73135370161917057,0.73135370161917057,null,1.3055555555555558]
[null,null,null,null,null,null,null,null,null,null,null,null,null,null,null,null,null,null,null,null,48,1.3333333333333333E-3,0.74314482547739413,0.74314482547739413,null,1.3333333333333335]
[null,null,null,null,null,null,null,null,null,null,null,null,null,null,null,null,null,null,null,null,49,1.3611111111111111E-3,0.75470958022277201,0.75470958022277201,null,1.3611111111111109]
[null,null,null,null,null,null,null,null,null,null,null,null,null,null,null,null,null,null,null,null,50,1.3888888888888889E-3,0.76604444311897812,0.76604444311897812,null,1.3888888888888888]
[null,null,null,null,null,null,null,null,null,null,null,null,null,null,null,null,null,null,null,null,51,1.4166666666666666E-3,0.77714596145697079,0.77714596145697079,null,1.4166666666666665]
[null,null,null,null,null,null,null,null,null,null,null,null,null,null,null,null,null,null,null,null,52,1.4444444444444444E-3,0.7880107536067219,0.7880107536067219,null,1.4444444444444444]
[null,null,null,null,null,null,null,null,null,null,null,null,null,null,null,null,null,null,null,null,53,1.4722222222222222E-3,0.79863551004729283,0.79863551004729283,null,1.4722222222222223]
[null,null,null,null,null,null,null,null,null,null,null,null,null,null,null,null,null,null,null,null,54,1.5E-3,0.80901699437494745,0.80901699437494745,null,1.5]
[null,null,null,null,null,null,null,null,null,null,null,null,null,null,null,null,null,null,null,null,55,1.5277777777777779E-3,0.8191520442889918,0.8191520442889918,null,1.5277777777777781]
[null,null,null,null,null,null,null,null,null,null,null,null,null,null,null,null,null,null,null,null,56,1.5555555555555557E-3,0.82903757255504174,0.82903757255504174,null,1.5555555555555558]
[null,null,null,null,null,null,null,null,null,null,null,null,null,null,null,null,null,null,null,null,57,1.5833333333333333E-3,0.83867056794542405,0.83867056794542405,null,1.5833333333333333]
[null,null,null,null,null,null,null,null,null,null,null,null,null,null,null,null,null,null,null,null,58,1.6111111111111113E-3,0.84804809615642596,0.84804809615642596,null,1.6111111111111112]
[null,null,null,null,null,null,null,null,null,null,null,null,null,null,null,null,null,null,null,null,59,1.6388888888888889E-3,0.85716730070211233,0.85716730070211233,null,1.6388888888888888]
[null,null,null,null,null,null,null,null,null,null,null,null,null,null,null,null,null,null,null,null,60,1.6666666666666666E-3,0.8660254037844386,0.8660254037844386,null,1.6666666666666665]
[null,null,null,null,null,null,null,null,null,null,null,null,null,null,null,null,null,null,null,null,61,1.6944444444444446E-3,0.87461970713939585,0.87461970713939585,null,1.6944444444444446]
[null,null,null,null,null,null,null,null,null,null,null,null,null,null,null,null,null,null,null,null,62,1.7222222222222222E-3,0.88294759285892688,0.88294759285892688,null,1.7222222222222223]
[null,null,null,null,null,null,null,null,null,null,null,null,null,null,null,null,null,null,null,null,63,1.7499999999999998E-3,0.89100652418836779,0.89100652418836779,null,1.75]
[null,null,null,null,null,null,null,null,null,null,null,null,null,null,null,null,null,null,null,null,64,1.7777777777777779E-3,0.89879404629916704,0.89879404629916704,null,1.7777777777777777]
[null,null,null,null,null,null,null,null,null,null,null,null,null,null,null,null,null,null,null,null,65,{"$f":"(U67/360)*R$2","v":1.8055555555555555E-3},{"$f":"SIN((((2*PI())*$D$4)*($V67-($D$6/1000)))+$R$1)","v":0.90630778703664994},{"$f":"SIN((((2*PI())*$F$4)*($V67-($F$6/1000)))+$R$3)","v":0.90630778703664994},null,{"$f":"1000*($U67/360)*$R$2","v":1.8055555555555554}]
[null,null,null,null,null,null,null,null,null,null,null,null,null,null,null,null,null,null,null,null,66,1.8333333333333333E-3,0.91354545764260087,0.91354545764260087,null,1.8333333333333333]
[null,null,null,null,null,null,null,null,null,null,null,null,null,null,null,null,null,null,null,null,{"$f":"U68+1","v":67},1.8611111111111111E-3,0.92050485345244037,0.92050485345244037,null,1.8611111111111112]
[null,null,null,null,null,null,null,null,null,null,null,null,null,null,null,null,null,null,null,null,68,1.888888888888889E-3,0.92718385456678742,0.92718385456678742,null,1.8888888888888888]
[null,null,null,null,null,null,null,null,null,null,null,null,null,null,null,null,null,null,null,null,69,1.9166666666666668E-3,0.93358042649720174,0.93358042649720174,null,1.916666666666667]
[null,null,null,null,null,null,null,null,null,null,null,null,null,null,null,null,null,null,null,null,70,1.9444444444444446E-3,0.93969262078590843,0.93969262078590843,null,1.9444444444444446]
[null,null,null,null,null,null,null,null,null,null,null,null,null,null,null,null,null,null,null,null,71,1.972222222222222E-3,0.94551857559931674,0.94551857559931674,null,1.9722222222222223]
[null,null,null,null,null,null,null,null,null,null,null,null,null,null,null,null,null,null,null,null,72,2E-3,0.95105651629515353,0.95105651629515353,null,2]
[null,null,null,null,null,null,null,null,null,null,null,null,null,null,null,null,null,null,null,null,73,2.0277777777777777E-3,0.95630475596303544,0.95630475596303544,null,2.0277777777777777]
[null,null,null,null,null,null,null,null,null,null,null,null,null,null,null,null,null,null,null,null,74,2.0555555555555557E-3,0.96126169593831889,0.96126169593831889,null,2.0555555555555554]
[null,null,null,null,null,null,null,null,null,null,null,null,null,null,null,null,null,null,null,null,75,2.0833333333333333E-3,0.96592582628906831,0.96592582628906831,null,2.0833333333333335]
[null,null,null,null,null,null,null,null,null,null,null,null,null,null,null,null,null,null,null,null,76,2.1111111111111113E-3,0.97029572627599647,0.97029572627599647,null,2.1111111111111112]
[null,null,null,null,null,null,null,null,null,null,null,null,null,null,null,null,null,null,null,null,77,2.138888888888889E-3,0.97437006478523525,0.97437006478523525,null,2.1388888888888888]
[null,null,null,null,null,null,null,null,null,null,null,null,null,null,null,null,null,null,null,null,78,2.166666666666667E-3,0.97814760073380569,0.97814760073380569,null,2.166666666666667]
[null,null,null,null,null,null,null,null,null,null,null,null,null,null,null,null,null,null,null,null,79,2.1944444444444446E-3,0.98162718344766398,0.98162718344766398,null,2.1944444444444442]
[null,null,null,null,null,null,null,null,null,null,null,null,null,null,null,null,null,null,null,null,80,2.2222222222222222E-3,0.98480775301220802,0.98480775301220802,null,2.2222222222222219]
[null,null,null,null,null,null,null,null,null,null,null,null,null,null,null,null,null,null,null,null,81,2.2500000000000003E-3,0.98768834059513777,0.98768834059513777,null,2.25]
[null,null,null,null,null,null,null,null,null,null,null,null,null,null,null,null,null,null,null,null,82,2.2777777777777779E-3,0.99026806874157036,0.99026806874157036,null,2.2777777777777777]
[null,null,null,null,null,null,null,null,null,null,null,null,null,null,null,null,null,null,null,null,83,2.3055555555555559E-3,0.99254615164132209,0.99254615164132209,null,2.3055555555555558]
[null,null,null,null,null,null,null,null,null,null,null,null,null,null,null,null,null,null,null,null,84,2.3333333333333335E-3,0.9945218953682734,0.9945218953682734,null,2.3333333333333335]
[null,null,null,null,null,null,null,null,null,null,null,null,null,null,null,null,null,null,null,null,85,2.3611111111111111E-3,0.99619469809174555,0.99619469809174555,null,2.3611111111111112]
[null,null,null,null,null,null,null,null,null,null,null,null,null,null,null,null,null,null,null,null,86,2.3888888888888892E-3,0.99756405025982431,0.99756405025982431,null,2.3888888888888893]
[null,null,null,null,null,null,null,null,null,null,null,null,null,null,null,null,null,null,null,null,87,2.4166666666666668E-3,0.99862953475457383,0.99862953475457383,null,2.4166666666666665]
[null,null,null,null,null,null,null,null,null,null,null,null,null,null,null,null,null,null,null,null,88,2.4444444444444444E-3,0.99939082701909576,0.99939082701909576,null,2.4444444444444442]
[null,null,null,null,null,null,null,null,null,null,null,null,null,null,null,null,null,null,null,null,89,2.4722222222222224E-3,0.99984769515639127,0.99984769515639127,null,2.4722222222222223]
[null,null,null,null,null,null,null,null,null,null,null,null,null,null,null,null,null,null,null,null,90,2.5000000000000001E-3,1,1,null,2.5]
[null,null,null,null,null,null,null,null,null,null,null,null,null,null,null,null,null,null,null,null,91,2.5277777777777777E-3,0.99984769515639127,0.99984769515639127,null,2.5277777777777777]
[null,null,null,null,null,null,null,null,null,null,null,null,null,null,null,null,null,null,null,null,92,2.5555555555555553E-3,0.99939082701909576,0.99939082701909576,null,2.5555555555555554]
[null,null,null,null,null,null,null,null,null,null,null,null,null,null,null,null,null,null,null,null,93,2.5833333333333337E-3,0.99862953475457383,0.99862953475457383,null,2.5833333333333339]
[null,null,null,null,null,null,null,null,null,null,null,null,null,null,null,null,null,null,null,null,94,2.6111111111111114E-3,0.9975640502598242,0.9975640502598242,null,2.6111111111111116]
[null,null,null,null,null,null,null,null,null,null,null,null,null,null,null,null,null,null,null,null,95,2.638888888888889E-3,0.99619469809174555,0.99619469809174555,null,2.6388888888888893]
[null,null,null,null,null,null,null,null,null,null,null,null,null,null,null,null,null,null,null,null,96,2.6666666666666666E-3,0.9945218953682734,0.9945218953682734,null,2.666666666666667]
[null,null,null,null,null,null,null,null,null,null,null,null,null,null,null,null,null,null,null,null,97,2.6944444444444442E-3,0.99254615164132209,0.99254615164132209,null,2.6944444444444446]
[null,null,null,null,null,null,null,null,null,null,null,null,null,null,null,null,null,null,null,null,98,2.7222222222222222E-3,0.99026806874157036,0.99026806874157036,null,2.7222222222222219]
[null,null,null,null,null,null,null,null,null,null,null,null,null,null,null,null,null,null,null,null,99,2.7500000000000003E-3,0.98768834059513766,0.98768834059513766,null,2.75]
[null,null,null,null,null,null,null,null,null,null,null,null,null,null,null,null,null,null,null,null,100,2.7777777777777779E-3,0.98480775301220802,0.98480775301220802,null,2.7777777777777777]
[null,null,null,null,null,null,null,null,null,null,null,null,null,null,null,null,null,null,null,null,101,2.8055555555555555E-3,0.98162718344766398,0.98162718344766398,null,2.8055555555555554]
[null,null,null,null,null,null,null,null,null,null,null,null,null,null,null,null,null,null,null,null,102,2.8333333333333331E-3,0.97814760073380569,0.97814760073380569,null,2.833333333333333]
[null,null,null,null,null,null,null,null,null,null,null,null,null,null,null,null,null,null,null,null,103,2.8611111111111111E-3,0.97437006478523525,0.97437006478523525,null,2.8611111111111107]
[null,null,null,null,null,null,null,null,null,null,null,null,null,null,null,null,null,null,null,null,104,2.8888888888888888E-3,0.97029572627599647,0.97029572627599647,null,2.8888888888888888]
[null,null,null,null,null,null,null,null,null,null,null,null,null,null,null,null,null,null,null,null,105,2.9166666666666668E-3,0.96592582628906831,0.96592582628906831,null,2.916666666666667]
[null,null,null,null,null,null,null,null,null,null,null,null,null,null,null,null,null,null,null,null,106,2.9444444444444444E-3,0.96126169593831889,0.96126169593831889,null,2.9444444444444446]
[null,null,null,null,null,null,null,null,null,null,null,null,null,null,null,null,null,null,null,null,107,2.9722222222222225E-3,0.95630475596303544,0.95630475596303544,null,2.9722222222222223]
[null,null,null,null,null,null,null,null,null,null,null,null,null,null,null,null,null,null,null,null,108,3.0000000000000001E-3,0.95105651629515353,0.95105651629515353,null,3]
[null,null,null,null,null,null,null,null,null,null,null,null,null,null,null,null,null,null,null,null,109,3.0277777777777777E-3,0.94551857559931685,0.94551857559931685,null,3.0277777777777777]
[null,null,null,null,null,null,null,null,null,null,null,null,null,null,null,null,null,null,null,null,110,3.0555555555555557E-3,0.93969262078590832,0.93969262078590832,null,3.0555555555555562]
[null,null,null,null,null,null,null,null,null,null,null,null,null,null,null,null,null,null,null,null,111,3.0833333333333338E-3,0.93358042649720163,0.93358042649720163,null,3.0833333333333339]
[null,null,null,null,null,null,null,null,null,null,null,null,null,null,null,null,null,null,null,null,112,3.1111111111111114E-3,0.92718385456678731,0.92718385456678731,null,3.1111111111111116]
[null,null,null,null,null,null,null,null,null,null,null,null,null,null,null,null,null,null,null,null,113,3.138888888888889E-3,0.92050485345244026,0.92050485345244026,null,3.1388888888888888]
[null,null,null,null,null,null,null,null,null,null,null,null,null,null,null,null,null,null,null,null,114,3.1666666666666666E-3,0.91354545764260087,0.91354545764260087,null,3.1666666666666665]
[null,null,null,null,null,null,null,null,null,null,null,null,null,null,null,null,null,null,null,null,115,3.1944444444444442E-3,0.90630778703665005,0.90630778703665005,null,3.1944444444444442]
[null,null,null,null,null,null,null,null,null,null,null,null,null,null,null,null,null,null,null,null,116,3.2222222222222227E-3,0.89879404629916693,0.89879404629916693,null,3.2222222222222223]
[null,null,null,null,null,null,null,null,null,null,null,null,null,null,null,null,null,null,null,null,117,3.2500000000000003E-3,0.89100652418836768,0.89100652418836768,null,3.25]
[null,null,null,null,null,null,null,null,null,null,null,null,null,null,null,null,null,null,null,null,118,3.2777777777777779E-3,0.88294759285892688,0.88294759285892688,null,3.2777777777777777]
[null,null,null,null,null,null,null,null,null,null,null,null,null,null,null,null,null,null,null,null,119,3.3055555555555555E-3,0.87461970713939585,0.87461970713939585,null,3.3055555555555554]
[null,null,null,null,null,null,null,null,null,null,null,null,null,null,null,null,null,null,null,null,120,3.3333333333333331E-3,0.86602540378443871,0.86602540378443871,null,3.333333333333333]
[null,null,null,null,null,null,null,null,null,null,null,null,null,null,null,null,null,null,null,null,121,3.3611111111111116E-3,0.857167300702112,0.857167300702112,null,3.3611111111111116]
[null,null,null,null,null,null,null,null,null,null,null,null,null,null,null,null,null,null,null,null,122,3.3888888888888892E-3,0.84804809615642585,0.84804809615642585,null,3.3888888888888893]
[null,null,null,null,null,null,null,null,null,null,null,null,null,null,null,null,null,null,null,null,123,3.4166666666666668E-3,0.83867056794542394,0.83867056794542394,null,3.416666666666667]
[null,null,null,null,null,null,null,null,null,null,null,null,null,null,null,null,null,null,null,null,124,3.4444444444444444E-3,0.82903757255504174,0.82903757255504174,null,3.4444444444444446]
[null,null,null,null,null,null,null,null,null,null,null,null,null,null,null,null,null,null,null,null,125,3.472222222222222E-3,0.81915204428899169,0.81915204428899169,null,3.4722222222222223]
[null,null,null,null,null,null,null,null,null,null,null,null,null,null,null,null,null,null,null,null,126,3.4999999999999996E-3,0.80901699437494745,0.80901699437494745,null,3.5]
[null,null,null,null,null,null,null,null,null,null,null,null,null,null,null,null,null,null,null,null,127,3.5277777777777781E-3,0.79863551004729272,0.79863551004729272,null,3.5277777777777786]
[null,null,null,null,null,null,null,null,null,null,null,null,null,null,null,null,null,null,null,null,128,3.5555555555555557E-3,0.78801075360672201,0.78801075360672201,null,3.5555555555555554]
[null,null,null,null,null,null,null,null,null,null,null,null,null,null,null,null,null,null,null,null,129,{"$f":"(U131/360)*R$2","v":3.5833333333333333E-3},{"$f":"SIN((((2*PI())*$D$4)*($V131-($D$6/1000)))+$R$1)","v":0.77714596145697079},{"$f":"SIN((((2*PI())*$F$4)*($V131-($F$6/1000)))+$R$3)","v":0.77714596145697079},null,{"$f":"1000*($U131/360)*$R$2","v":3.583333333333333}]
[null,null,null,null,null,null,null,null,null,null,null,null,null,null,null,null,null,null,null,null,130,3.6111111111111109E-3,0.76604444311897801,0.76604444311897801,null,3.6111111111111107]
[null,null,null,null,null,null,null,null,null,null,null,null,null,null,null,null,null,null,null,null,{"$f":"U132+1","v":131},3.638888888888889E-3,0.75470958022277179,0.75470958022277179,null,3.6388888888888888]
[null,null,null,null,null,null,null,null,null,null,null,null,null,null,null,null,null,null,null,null,132,3.6666666666666666E-3,0.74314482547739424,0.74314482547739424,null,3.6666666666666665]
[null,null,null,null,null,null,null,null,null,null,null,null,null,null,null,null,null,null,null,null,133,3.6944444444444446E-3,0.73135370161917024,0.73135370161917024,null,3.6944444444444446]
[null,null,null,null,null,null,null,null,null,null,null,null,null,null,null,null,null,null,null,null,134,3.7222222222222223E-3,0.71933980033865108,0.71933980033865108,null,3.7222222222222223]
[null,null,null,null,null,null,null,null,null,null,null,null,null,null,null,null,null,null,null,null,135,3.7499999999999999E-3,0.70710678118654757,0.70710678118654757,null,3.75]
[null,null,null,null,null,null,null,null,null,null,null,null,null,null,null,null,null,null,null,null,136,3.7777777777777779E-3,0.69465837045899714,0.69465837045899714,null,3.7777777777777777]
[null,null,null,null,null,null,null,null,null,null,null,null,null,null,null,null,null,null,null,null,137,3.8055555555555555E-3,0.68199836006249859,0.68199836006249859,null,3.8055555555555554]
[null,null,null,null,null,null,null,null,null,null,null,null,null,null,null,null,null,null,null,null,138,3.8333333333333336E-3,0.66913060635885802,0.66913060635885802,null,3.8333333333333339]
[null,null,null,null,null,null,null,null,null,null,null,null,null,null,null,null,null,null,null,null,139,3.8611111111111112E-3,0.65605902899050728,0.65605902899050728,null,3.8611111111111116]
[null,null,null,null,null,null,null,null,null,null,null,null,null,null,null,null,null,null,null,null,140,3.8888888888888892E-3,0.64278760968653914,0.64278760968653914,null,3.8888888888888893]
[null,null,null,null,null,null,null,null,null,null,null,null,null,null,null,null,null,null,null,null,141,3.9166666666666664E-3,0.62932039104983739,0.62932039104983739,null,3.916666666666667]
[null,null,null,null,null,null,null,null,null,null,null,null,null,null,null,null,null,null,null,null,142,3.944444444444444E-3,0.6156614753256584,0.6156614753256584,null,3.9444444444444446]
[null,null,null,null,null,null,null,null,null,null,null,null,null,null,null,null,null,null,null,null,143,3.9722222222222225E-3,0.60181502315204816,0.60181502315204816,null,3.9722222222222219]
[null,null,null,null,null,null,null,null,null,null,null,null,null,null,null,null,null,null,null,null,144,4.0000000000000001E-3,0.58778525229247325,0.58778525229247325,null,4]
[null,null,null,null,null,null,null,null,null,null,null,null,null,null,null,null,null,null,null,null,145,4.0277777777777777E-3,0.57357643635104594,0.57357643635104594,null,4.0277777777777777]
[null,null,null,null,null,null,null,null,null,null,null,null,null,null,null,null,null,null,null,null,146,4.0555555555555553E-3,0.5591929034707469,0.5591929034707469,null,4.0555555555555554]
[null,null,null,null,null,null,null,null,null,null,null,null,null,null,null,null,null,null,null,null,147,4.0833333333333329E-3,0.54463903501502731,0.54463903501502731,null,4.083333333333333]
[null,null,null,null,null,null,null,null,null,null,null,null,null,null,null,null,null,null,null,null,148,4.1111111111111114E-3,0.5299192642332049,0.5299192642332049,null,4.1111111111111107]
[null,null,null,null,null,null,null,null,null,null,null,null,null,null,null,null,null,null,null,null,149,4.138888888888889E-3,0.51503807491005404,0.51503807491005404,null,4.1388888888888884]
[null,null,null,null,null,null,null,null,null,null,null,null,null,null,null,null,null,null,null,null,150,4.1666666666666666E-3,0.49999999999999994,0.49999999999999994,null,4.166666666666667]
[null,null,null,null,null,null,null,null,null,null,null,null,null,null,null,null,null,null,null,null,151,4.1944444444444442E-3,0.48480962024633717,0.48480962024633717,null,4.1944444444444446]
[null,null,null,null,null,null,null,null,null,null,null,null,null,null,null,null,null,null,null,null,152,4.2222222222222227E-3,0.46947156278589069,0.46947156278589069,null,4.2222222222222223]
[null,null,null,null,null,null,null,null,null,null,null,null,null,null,null,null,null,null,null,null,153,4.2500000000000003E-3,0.45399049973954647,0.45399049973954647,null,4.25]
[null,null,null,null,null,null,null,null,null,null,null,null,null,null,null,null,null,null,null,null,154,4.2777777777777779E-3,0.43837114678907729,0.43837114678907729,null,4.2777777777777777]
[null,null,null,null,null,null,null,null,null,null,null,null,null,null,null,null,null,null,null,null,155,4.3055555555555555E-3,0.4226182617406995,0.4226182617406995,null,4.3055555555555562]
[null,null,null,null,null,null,null,null,null,null,null,null,null,null,null,null,null,null,null,null,156,4.333333333333334E-3,0.40673664307579965,0.40673664307579965,null,4.3333333333333339]
[null,null,null,null,null,null,null,null,null,null,null,null,null,null,null,null,null,null,null,null,157,4.3611111111111116E-3,0.39073112848927333,0.39073112848927333,null,4.3611111111111116]
[null,null,null,null,null,null,null,null,null,null,null,null,null,null,null,null,null,null,null,null,158,4.3888888888888892E-3,0.37460659341591179,0.37460659341591179,null,4.3888888888888884]
[null,null,null,null,null,null,null,null,null,null,null,null,null,null,null,null,null,null,null,null,159,4.4166666666666668E-3,0.35836794954530021,0.35836794954530021,null,4.4166666666666661]
[null,null,null,null,null,null,null,null,null,null,null,null,null,null,null,null,null,null,null,null,160,4.4444444444444444E-3,0.34202014332566888,0.34202014332566888,null,4.4444444444444438]
[null,null,null,null,null,null,null,null,null,null,null,null,null,null,null,null,null,null,null,null,161,4.4722222222222229E-3,0.32556815445715614,0.32556815445715614,null,4.4722222222222223]
[null,null,null,null,null,null,null,null,null,null,null,null,null,null,null,null,null,null,null,null,162,4.5000000000000005E-3,0.30901699437494712,0.30901699437494712,null,4.5]
[null,null,null,null,null,null,null,null,null,null,null,null,null,null,null,null,null,null,null,null,163,4.5277777777777781E-3,0.2923717047227366,0.2923717047227366,null,4.5277777777777777]
[null,null,null,null,null,null,null,null,null,null,null,null,null,null,null,null,null,null,null,null,164,4.5555555555555557E-3,0.27563735581699922,0.27563735581699922,null,4.5555555555555554]
[null,null,null,null,null,null,null,null,null,null,null,null,null,null,null,null,null,null,null,null,165,4.5833333333333334E-3,0.25881904510252057,0.25881904510252057,null,4.583333333333333]
[null,null,null,null,null,null,null,null,null,null,null,null,null,null,null,null,null,null,null,null,166,4.6111111111111118E-3,0.24192189559966731,0.24192189559966731,null,4.6111111111111116]
[null,null,null,null,null,null,null,null,null,null,null,null,null,null,null,null,null,null,null,null,167,4.6388888888888894E-3,0.22495105434386478,0.22495105434386478,null,4.6388888888888893]
[null,null,null,null,null,null,null,null,null,null,null,null,null,null,null,null,null,null,null,null,168,4.6666666666666671E-3,0.20791169081775887,0.20791169081775887,null,4.666666666666667]
[null,null,null,null,null,null,null,null,null,null,null,null,null,null,null,null,null,null,null,null,169,4.6944444444444447E-3,0.19080899537654453,0.19080899537654453,null,4.6944444444444446]
[null,null,null,null,null,null,null,null,null,null,null,null,null,null,null,null,null,null,null,null,170,4.7222222222222223E-3,0.17364817766693028,0.17364817766693028,null,4.7222222222222223]
[null,null,null,null,null,null,null,null,null,null,null,null,null,null,null,null,null,null,null,null,171,4.7499999999999999E-3,0.15643446504023098,0.15643446504023098,null,4.75]
[null,null,null,null,null,null,null,null,null,null,null,null,null,null,null,null,null,null,null,null,172,4.7777777777777784E-3,0.13917310096006488,0.13917310096006488,null,4.7777777777777786]
[null,null,null,null,null,null,null,null,null,null,null,null,null,null,null,null,null,null,null,null,173,4.805555555555556E-3,0.1218693434051471,0.1218693434051471,null,4.8055555555555554]
[null,null,null,null,null,null,null,null,null,null,null,null,null,null,null,null,null,null,null,null,174,4.8333333333333336E-3,0.10452846326765329,0.10452846326765329,null,4.833333333333333]
[null,null,null,null,null,null,null,null,null,null,null,null,null,null,null,null,null,null,null,null,175,4.8611111111111112E-3,8.7155742747658194E-2,8.7155742747658194E-2,null,4.8611111111111107]
[null,null,null,null,null,null,null,null,null,null,null,null,null,null,null,null,null,null,null,null,176,4.8888888888888888E-3,6.9756473744125524E-2,6.9756473744125524E-2,null,4.8888888888888884]
[null,null,null,null,null,null,null,null,null,null,null,null,null,null,null,null,null,null,null,null,177,4.9166666666666664E-3,5.2335956242943807E-2,5.2335956242943807E-2,null,4.9166666666666661]
[null,null,null,null,null,null,null,null,null,null,null,null,null,null,null,null,null,null,null,null,178,4.9444444444444449E-3,3.4899496702500699E-2,3.4899496702500699E-2,null,4.9444444444444446]
[null,null,null,null,null,null,null,null,null,null,null,null,null,null,null,null,null,null,null,null,179,4.9722222222222225E-3,1.7452406437283439E-2,1.7452406437283439E-2,null,4.9722222222222223]
[null,null,null,null,null,null,null,null,null,null,null,null,null,null,null,null,null,null,null,null,180,5.0000000000000001E-3,1.22514845490862E-16,1.22514845490862E-16,null,5]
[null,null,null,null,null,null,null,null,null,null,null,null,null,null,null,null,null,null,null,null,181,5.0277777777777777E-3,-1.7452406437283637E-2,-1.7452406437283637E-2,null,5.0277777777777777]
[null,null,null,null,null,null,null,null,null,null,null,null,null,null,null,null,null,null,null,null,182,5.0555555555555553E-3,-3.48994967025009E-2,-3.48994967025009E-2,null,5.0555555555555554]
[null,null,null,null,null,null,null,null,null,null,null,null,null,null,null,null,null,null,null,null,183,5.0833333333333329E-3,-5.2335956242943557E-2,-5.2335956242943557E-2,null,5.083333333333333]
[null,null,null,null,null,null,null,null,null,null,null,null,null,null,null,null,null,null,null,null,184,5.1111111111111105E-3,-6.9756473744124831E-2,-6.9756473744124831E-2,null,5.1111111111111107]
[null,null,null,null,null,null,null,null,null,null,null,null,null,null,null,null,null,null,null,null,185,5.1388888888888882E-3,-8.7155742747657944E-2,-8.7155742747657944E-2,null,5.1388888888888884]
[null,null,null,null,null,null,null,null,null,null,null,null,null,null,null,null,null,null,null,null,186,5.1666666666666675E-3,-0.10452846326765393,-0.10452846326765393,null,5.1666666666666679]
[null,null,null,null,null,null,null,null,null,null,null,null,null,null,null,null,null,null,null,null,187,5.1944444444444451E-3,-0.12186934340514774,-0.12186934340514774,null,5.1944444444444446]
[null,null,null,null,null,null,null,null,null,null,null,null,null,null,null,null,null,null,null,null,188,5.2222222222222227E-3,-0.13917310096006597,-0.13917310096006597,null,5.2222222222222232]
[null,null,null,null,null,null,null,null,null,null,null,null,null,null,null,null,null,null,null,null,189,5.2500000000000003E-3,-0.15643446504023117,-0.15643446504023117,null,5.25]
[null,null,null,null,null,null,null,null,null,null,null,null,null,null,null,null,null,null,null,null,190,5.2777777777777779E-3,-0.17364817766693047,-0.17364817766693047,null,5.2777777777777786]
[null,null,null,null,null,null,null,null,null,null,null,null,null,null,null,null,null,null,null,null,191,5.3055555555555555E-3,-0.19080899537654472,-0.19080899537654472,null,5.3055555555555554]
[null,null,null,null,null,null,null,null,null,null,null,null,null,null,null,null,null,null,null,null,192,5.3333333333333332E-3,-0.20791169081775907,-0.20791169081775907,null,5.3333333333333339]
[null,null,null,null,null,null,null,null,null,null,null,null,null,null,null,null,null,null,null,null,193,{"$f":"(U195/360)*R$2","v":5.3611111111111108E-3},{"$f":"SIN((((2*PI())*$D$4)*($V195-($D$6/1000)))+$R$1)","v":-0.22495105434386498},{"$f":"SIN((((2*PI())*$F$4)*($V195-($F$6/1000)))+$R$3)","v":-0.22495105434386498},null,{"$f":"1000*($U195/360)*$R$2","v":5.3611111111111107}]
[null,null,null,null,null,null,null,null,null,null,null,null,null,null,null,null,null,null,null,null,194,5.3888888888888884E-3,-0.24192189559966751,-0.24192189559966751,null,5.3888888888888893]
[null,null,null,null,null,null,null,null,null,null,null,null,null,null,null,null,null,null,null,null,{"$f":"U196+1","v":195},5.416666666666666E-3,-0.25881904510252035,-0.25881904510252035,null,5.4166666666666661]
[null,null,null,null,null,null,null,null,null,null,null,null,null,null,null,null,null,null,null,null,196,5.4444444444444445E-3,-0.275637355816999,-0.275637355816999,null,5.4444444444444438]
[null,null,null,null,null,null,null,null,null,null,null,null,null,null,null,null,null,null,null,null,197,5.4722222222222229E-3,-0.29237170472273721,-0.29237170472273721,null,5.4722222222222232]
[null,null,null,null,null,null,null,null,null,null,null,null,null,null,null,null,null,null,null,null,198,5.5000000000000005E-3,-0.30901699437494773,-0.30901699437494773,null,5.5]
[null,null,null,null,null,null,null,null,null,null,null,null,null,null,null,null,null,null,null,null,199,5.5277777777777782E-3,-0.32556815445715676,-0.32556815445715676,null,5.5277777777777786]
[null,null,null,null,null,null,null,null,null,null,null,null,null,null,null,null,null,null,null,null,200,5.5555555555555558E-3,-0.34202014332566905,-0.34202014332566905,null,5.5555555555555554]
[null,null,null,null,null,null,null,null,null,null,null,null,null,null,null,null,null,null,null,null,201,5.5833333333333334E-3,-0.35836794954530043,-0.35836794954530043,null,5.5833333333333339]
[null,null,null,null,null,null,null,null,null,null,null,null,null,null,null,null,null,null,null,null,202,5.611111111111111E-3,-0.37460659341591201,-0.37460659341591201,null,5.6111111111111107]
[null,null,null,null,null,null,null,null,null,null,null,null,null,null,null,null,null,null,null,null,203,5.6388888888888886E-3,-0.39073112848927355,-0.39073112848927355,null,5.6388888888888893]
[null,null,null,null,null,null,null,null,null,null,null,null,null,null,null,null,null,null,null,null,204,5.6666666666666662E-3,-0.40673664307579982,-0.40673664307579982,null,5.6666666666666661]
[null,null,null,null,null,null,null,null,null,null,null,null,null,null,null,null,null,null,null,null,205,5.6944444444444447E-3,-0.42261826174069966,-0.42261826174069966,null,5.6944444444444446]
[null,null,null,null,null,null,null,null,null,null,null,null,null,null,null,null,null,null,null,null,206,5.7222222222222223E-3,-0.43837114678907746,-0.43837114678907746,null,5.7222222222222214]
[null,null,null,null,null,null,null,null,null,null,null,null,null,null,null,null,null,null,null,null,207,5.7499999999999999E-3,-0.45399049973954669,-0.45399049973954669,null,5.75]
[null,null,null,null,null,null,null,null,null,null,null,null,null,null,null,null,null,null,null,null,208,5.7777777777777775E-3,-0.46947156278589047,-0.46947156278589047,null,5.7777777777777777]
[null,null,null,null,null,null,null,null,null,null,null,null,null,null,null,null,null,null,null,null,209,5.805555555555556E-3,-0.48480962024633734,-0.48480962024633734,null,5.8055555555555562]
[null,null,null,null,null,null,null,null,null,null,null,null,null,null,null,null,null,null,null,null,210,5.8333333333333336E-3,-0.50000000000000011,-0.50000000000000011,null,5.8333333333333339]
[null,null,null,null,null,null,null,null,null,null,null,null,null,null,null,null,null,null,null,null,211,5.8611111111111112E-3,-0.51503807491005416,-0.51503807491005416,null,5.8611111111111107]
[null,null,null,null,null,null,null,null,null,null,null,null,null,null,null,null,null,null,null,null,212,5.8888888888888888E-3,-0.52991926423320479,-0.52991926423320479,null,5.8888888888888893]
[null,null,null,null,null,null,null,null,null,null,null,null,null,null,null,null,null,null,null,null,213,5.9166666666666673E-3,-0.54463903501502742,-0.54463903501502742,null,5.9166666666666661]
[null,null,null,null,null,null,null,null,null,null,null,null,null,null,null,null,null,null,null,null,214,5.9444444444444449E-3,-0.55919290347074702,-0.55919290347074702,null,5.9444444444444446]
[null,null,null,null,null,null,null,null,null,null,null,null,null,null,null,null,null,null,null,null,215,5.9722222222222225E-3,-0.57357643635104616,-0.57357643635104616,null,5.9722222222222214]
[null,null,null,null,null,null,null,null,null,null,null,null,null,null,null,null,null,null,null,null,216,6.0000000000000001E-3,-0.58778525229247336,-0.58778525229247336,null,6]
[null,null,null,null,null,null,null,null,null,null,null,null,null,null,null,null,null,null,null,null,217,6.0277777777777777E-3,-0.60181502315204838,-0.60181502315204838,null,6.0277777777777777]
[null,null,null,null,null,null,null,null,null,null,null,null,null,null,null,null,null,null,null,null,218,6.0555555555555553E-3,-0.61566147532565818,-0.61566147532565818,null,6.0555555555555554]
[null,null,null,null,null,null,null,null,null,null,null,null,null,null,null,null,null,null,null,null,219,6.083333333333333E-3,-0.62932039104983717,-0.62932039104983717,null,6.083333333333333]
[null,null,null,null,null,null,null,null,null,null,null,null,null,null,null,null,null,null,null,null,220,6.1111111111111114E-3,-0.64278760968653958,-0.64278760968653958,null,6.1111111111111125]
[null,null,null,null,null,null,null,null,null,null,null,null,null,null,null,null,null,null,null,null,221,6.138888888888889E-3,-0.65605902899050739,-0.65605902899050739,null,6.1388888888888893]
[null,null,null,null,null,null,null,null,null,null,null,null,null,null,null,null,null,null,null,null,222,6.1666666666666675E-3,-0.66913060635885857,-0.66913060635885857,null,6.1666666666666679]
[null,null,null,null,null,null,null,null,null,null,null,null,null,null,null,null,null,null,null,null,223,6.1944444444444451E-3,-0.6819983600624987,-0.6819983600624987,null,6.1944444444444446]
[null,null,null,null,null,null,null,null,null,null,null,null,null,null,null,null,null,null,null,null,224,6.2222222222222227E-3,-0.69465837045899759,-0.69465837045899759,null,6.2222222222222232]
[null,null,null,null,null,null,null,null,null,null,null,null,null,null,null,null,null,null,null,null,225,6.2500000000000003E-3,-0.70710678118654768,-0.70710678118654768,null,6.25]
[null,null,null,null,null,null,null,null,null,null,null,null,null,null,null,null,null,null,null,null,226,6.277777777777778E-3,-0.71933980033865119,-0.71933980033865119,null,6.2777777777777777]
[null,null,null,null,null,null,null,null,null,null,null,null,null,null,null,null,null,null,null,null,227,6.3055555555555556E-3,-0.73135370161917046,-0.73135370161917046,null,6.3055555555555554]
[null,null,null,null,null,null,null,null,null,null,null,null,null,null,null,null,null,null,null,null,228,6.3333333333333332E-3,-0.74314482547739436,-0.74314482547739436,null,6.333333333333333]
[null,null,null,null,null,null,null,null,null,null,null,null,null,null,null,null,null,null,null,null,229,6.3611111111111108E-3,-0.75470958022277201,-0.75470958022277201,null,6.3611111111111107]
[null,null,null,null,null,null,null,null,null,null,null,null,null,null,null,null,null,null,null,null,230,6.3888888888888884E-3,-0.7660444431189779,-0.7660444431189779,null,6.3888888888888884]
[null,null,null,null,null,null,null,null,null,null,null,null,null,null,null,null,null,null,null,null,231,6.4166666666666677E-3,-0.77714596145697112,-0.77714596145697112,null,6.4166666666666679]
[null,null,null,null,null,null,null,null,null,null,null,null,null,null,null,null,null,null,null,null,232,6.4444444444444453E-3,-0.78801075360672213,-0.78801075360672213,null,6.4444444444444446]
[null,null,null,null,null,null,null,null,null,null,null,null,null,null,null,null,null,null,null,null,233,6.472222222222223E-3,-0.79863551004729338,-0.79863551004729338,null,6.4722222222222232]
[null,null,null,null,null,null,null,null,null,null,null,null,null,null,null,null,null,null,null,null,234,6.5000000000000006E-3,-0.8090169943749479,-0.8090169943749479,null,6.5]
[null,null,null,null,null,null,null,null,null,null,null,null,null,null,null,null,null,null,null,null,235,6.5277777777777782E-3,-0.81915204428899213,-0.81915204428899213,null,6.5277777777777786]
[null,null,null,null,null,null,null,null,null,null,null,null,null,null,null,null,null,null,null,null,236,6.5555555555555558E-3,-0.82903757255504185,-0.82903757255504185,null,6.5555555555555554]
[null,null,null,null,null,null,null,null,null,null,null,null,null,null,null,null,null,null,null,null,237,6.5833333333333334E-3,-0.83867056794542405,-0.83867056794542405,null,6.5833333333333339]
[null,null,null,null,null,null,null,null,null,null,null,null,null,null,null,null,null,null,null,null,238,6.611111111111111E-3,-0.84804809615642596,-0.84804809615642596,null,6.6111111111111107]
[null,null,null,null,null,null,null,null,null,null,null,null,null,null,null,null,null,null,null,null,239,6.6388888888888886E-3,-0.85716730070211211,-0.85716730070211211,null,6.6388888888888893]
[null,null,null,null,null,null,null,null,null,null,null,null,null,null,null,null,null,null,null,null,240,6.6666666666666662E-3,-0.86602540378443837,-0.86602540378443837,null,6.6666666666666661]
[null,null,null,null,null,null,null,null,null,null,null,null,null,null,null,null,null,null,null,null,241,6.6944444444444438E-3,-0.87461970713939552,-0.87461970713939552,null,6.6944444444444438]
[null,null,null,null,null,null,null,null,null,null,null,null,null,null,null,null,null,null,null,null,242,6.7222222222222232E-3,-0.88294759285892732,-0.88294759285892732,null,6.7222222222222232]
[null,null,null,null,null,null,null,null,null,null,null,null,null,null,null,null,null,null,null,null,243,6.7500000000000008E-3,-0.89100652418836823,-0.89100652418836823,null,6.75]
[null,null,null,null,null,null,null,null,null,null,null,null,null,null,null,null,null,null,null,null,244,6.7777777777777784E-3,-0.89879404629916726,-0.89879404629916726,null,6.7777777777777786]
[null,null,null,null,null,null,null,null,null,null,null,null,null,null,null,null,null,null,null,null,245,6.805555555555556E-3,-0.90630778703665005,-0.90630778703665005,null,6.8055555555555554]
[null,null,null,null,null,null,null,null,null,null,null,null,null,null,null,null,null,null,null,null,246,6.8333333333333336E-3,-0.91354545764260098,-0.91354545764260098,null,6.8333333333333339]
[null,null,null,null,null,null,null,null,null,null,null,null,null,null,null,null,null,null,null,null,247,6.8611111111111112E-3,-0.92050485345244026,-0.92050485345244026,null,6.8611111111111107]
[null,null,null,null,null,null,null,null,null,null,null,null,null,null,null,null,null,null,null,null,248,6.8888888888888888E-3,-0.92718385456678731,-0.92718385456678731,null,6.8888888888888893]
[null,null,null,null,null,null,null,null,null,null,null,null,null,null,null,null,null,null,null,null,249,6.9166666666666664E-3,-0.93358042649720163,-0.93358042649720163,null,6.9166666666666661]
[null,null,null,null,null,null,null,null,null,null,null,null,null,null,null,null,null,null,null,null,250,6.9444444444444441E-3,-0.93969262078590843,-0.93969262078590843,null,6.9444444444444446]
[null,null,null,null,null,null,null,null,null,null,null,null,null,null,null,null,null,null,null,null,251,6.9722222222222217E-3,-0.94551857559931685,-0.94551857559931685,null,6.9722222222222214]
[null,null,null,null,null,null,null,null,null,null,null,null,null,null,null,null,null,null,null,null,252,6.9999999999999993E-3,-0.95105651629515353,-0.95105651629515353,null,7]
[null,null,null,null,null,null,null,null,null,null,null,null,null,null,null,null,null,null,null,null,253,7.0277777777777778E-3,-0.95630475596303532,-0.95630475596303532,null,7.0277777777777777]
[null,null,null,null,null,null,null,null,null,null,null,null,null,null,null,null,null,null,null,null,254,7.0555555555555562E-3,-0.96126169593831901,-0.96126169593831901,null,7.0555555555555571]
[null,null,null,null,null,null,null,null,null,null,null,null,null,null,null,null,null,null,null,null,255,7.0833333333333338E-3,-0.96592582628906831,-0.96592582628906831,null,7.0833333333333339]
[null,null,null,null,null,null,null,null,null,null,null,null,null,null,null,null,null,null,null,null,256,7.1111111111111115E-3,-0.97029572627599647,-0.97029572627599647,null,7.1111111111111107]
[null,null,null,null,null,null,null,null,null,null,null,null,null,null,null,null,null,null,null,null,257,{"$f":"(U259/360)*R$2","v":7.1388888888888891E-3},{"$f":"SIN((((2*PI())*$D$4)*($V259-($D$6/1000)))+$R$1)","v":-0.97437006478523513},{"$f":"SIN((((2*PI())*$F$4)*($V259-($F$6/1000)))+$R$3)","v":-0.97437006478523513},null,{"$f":"1000*($U259/360)*$R$2","v":7.1388888888888893}]
[null,null,null,null,null,null,null,null,null,null,null,null,null,null,null,null,null,null,null,null,258,7.1666666666666667E-3,-0.97814760073380569,-0.97814760073380569,null,7.1666666666666661]
[null,null,null,null,null,null,null,null,null,null,null,null,null,null,null,null,null,null,null,null,{"$f":"U260+1","v":259},7.1944444444444443E-3,-0.98162718344766398,-0.98162718344766398,null,7.1944444444444446]
[null,null,null,null,null,null,null,null,null,null,null,null,null,null,null,null,null,null,null,null,260,7.2222222222222219E-3,-0.98480775301220802,-0.98480775301220802,null,7.2222222222222214]
[null,null,null,null,null,null,null,null,null,null,null,null,null,null,null,null,null,null,null,null,261,7.2499999999999995E-3,-0.98768834059513766,-0.98768834059513766,null,7.25]
[null,null,null,null,null,null,null,null,null,null,null,null,null,null,null,null,null,null,null,null,262,7.277777777777778E-3,-0.99026806874157036,-0.99026806874157036,null,7.2777777777777777]
[null,null,null,null,null,null,null,null,null,null,null,null,null,null,null,null,null,null,null,null,263,7.3055555555555556E-3,-0.99254615164132209,-0.99254615164132209,null,7.3055555555555554]
[null,null,null,null,null,null,null,null,null,null,null,null,null,null,null,null,null,null,null,null,264,7.3333333333333332E-3,-0.9945218953682734,-0.9945218953682734,null,7.333333333333333]
[null,null,null,null,null,null,null,null,null,null,null,null,null,null,null,null,null,null,null,null,265,7.3611111111111117E-3,-0.99619469809174566,-0.99619469809174566,null,7.3611111111111125]
[null,null,null,null,null,null,null,null,null,null,null,null,null,null,null,null,null,null,null,null,266,7.3888888888888893E-3,-0.99756405025982431,-0.99756405025982431,null,7.3888888888888893]
[null,null,null,null,null,null,null,null,null,null,null,null,null,null,null,null,null,null,null,null,267,7.4166666666666669E-3,-0.99862953475457394,-0.99862953475457394,null,7.4166666666666679]
[null,null,null,null,null,null,null,null,null,null,null,null,null,null,null,null,null,null,null,null,268,7.4444444444444445E-3,-0.99939082701909576,-0.99939082701909576,null,7.4444444444444446]
[null,null,null,null,null,null,null,null,null,null,null,null,null,null,null,null,null,null,null,null,269,7.4722222222222221E-3,-0.99984769515639127,-0.99984769515639127,null,7.4722222222222232]
[null,null,null,null,null,null,null,null,null,null,null,null,null,null,null,null,null,null,null,null,270,7.4999999999999997E-3,-1,-1,null,7.5]
[null,null,null,null,null,null,null,null,null,null,null,null,null,null,null,null,null,null,null,null,271,7.5277777777777782E-3,-0.99984769515639127,-0.99984769515639127,null,7.5277777777777777]
[null,null,null,null,null,null,null,null,null,null,null,null,null,null,null,null,null,null,null,null,272,7.5555555555555558E-3,-0.99939082701909576,-0.99939082701909576,null,7.5555555555555554]
[null,null,null,null,null,null,null,null,null,null,null,null,null,null,null,null,null,null,null,null,273,7.5833333333333334E-3,-0.99862953475457383,-0.99862953475457383,null,7.583333333333333]
[null,null,null,null,null,null,null,null,null,null,null,null,null,null,null,null,null,null,null,null,274,7.611111111111111E-3,-0.99756405025982431,-0.99756405025982431,null,7.6111111111111107]
[null,null,null,null,null,null,null,null,null,null,null,null,null,null,null,null,null,null,null,null,275,7.6388888888888886E-3,-0.99619469809174555,-0.99619469809174555,null,7.6388888888888884]
[null,null,null,null,null,null,null,null,null,null,null,null,null,null,null,null,null,null,null,null,276,7.6666666666666671E-3,-0.99452189536827329,-0.99452189536827329,null,7.6666666666666679]
[null,null,null,null,null,null,null,null,null,null,null,null,null,null,null,null,null,null,null,null,277,7.6944444444444447E-3,-0.99254615164132198,-0.99254615164132198,null,7.6944444444444446]
[null,null,null,null,null,null,null,null,null,null,null,null,null,null,null,null,null,null,null,null,278,7.7222222222222223E-3,-0.99026806874157036,-0.99026806874157036,null,7.7222222222222232]
[null,null,null,null,null,null,null,null,null,null,null,null,null,null,null,null,null,null,null,null,279,7.7500000000000008E-3,-0.98768834059513766,-0.98768834059513766,null,7.75]
[null,null,null,null,null,null,null,null,null,null,null,null,null,null,null,null,null,null,null,null,280,7.7777777777777784E-3,-0.98480775301220802,-0.98480775301220802,null,7.7777777777777786]
[null,null,null,null,null,null,null,null,null,null,null,null,null,null,null,null,null,null,null,null,281,7.805555555555556E-3,-0.98162718344766386,-0.98162718344766386,null,7.8055555555555554]
[null,null,null,null,null,null,null,null,null,null,null,null,null,null,null,null,null,null,null,null,282,7.8333333333333328E-3,-0.97814760073380558,-0.97814760073380558,null,7.8333333333333339]
[null,null,null,null,null,null,null,null,null,null,null,null,null,null,null,null,null,null,null,null,283,7.8611111111111104E-3,-0.97437006478523525,-0.97437006478523525,null,7.8611111111111107]
[null,null,null,null,null,null,null,null,null,null,null,null,null,null,null,null,null,null,null,null,284,7.888888888888888E-3,-0.97029572627599658,-0.97029572627599658,null,7.8888888888888893]
[null,null,null,null,null,null,null,null,null,null,null,null,null,null,null,null,null,null,null,null,285,7.9166666666666656E-3,-0.96592582628906842,-0.96592582628906842,null,7.9166666666666661]
[null,null,null,null,null,null,null,null,null,null,null,null,null,null,null,null,null,null,null,null,286,7.9444444444444449E-3,-0.96126169593831878,-0.96126169593831878,null,7.9444444444444438]
[null,null,null,null,null,null,null,null,null,null,null,null,null,null,null,null,null,null,null,null,287,7.9722222222222226E-3,-0.95630475596303544,-0.95630475596303544,null,7.9722222222222232]
[null,null,null,null,null,null,null,null,null,null,null,null,null,null,null,null,null,null,null,null,288,8.0000000000000002E-3,-0.95105651629515364,-0.95105651629515364,null,8]
[null,null,null,null,null,null,null,null,null,null,null,null,null,null,null,null,null,null,null,null,289,8.0277777777777778E-3,-0.94551857559931696,-0.94551857559931696,null,8.0277777777777786]
[null,null,null,null,null,null,null,null,null,null,null,null,null,null,null,null,null,null,null,null,290,8.0555555555555554E-3,-0.93969262078590832,-0.93969262078590832,null,8.0555555555555554]
[null,null,null,null,null,null,null,null,null,null,null,null,null,null,null,null,null,null,null,null,291,8.083333333333333E-3,-0.93358042649720174,-0.93358042649720174,null,8.0833333333333339]
[null,null,null,null,null,null,null,null,null,null,null,null,null,null,null,null,null,null,null,null,292,8.1111111111111106E-3,-0.92718385456678742,-0.92718385456678742,null,8.1111111111111107]
[null,null,null,null,null,null,null,null,null,null,null,null,null,null,null,null,null,null,null,null,293,8.1388888888888882E-3,-0.92050485345244049,-0.92050485345244049,null,8.1388888888888893]
[null,null,null,null,null,null,null,null,null,null,null,null,null,null,null,null,null,null,null,null,294,8.1666666666666658E-3,-0.91354545764260109,-0.91354545764260109,null,8.1666666666666661]
[null,null,null,null,null,null,null,null,null,null,null,null,null,null,null,null,null,null,null,null,295,8.1944444444444452E-3,-0.90630778703664994,-0.90630778703664994,null,8.1944444444444446]
[null,null,null,null,null,null,null,null,null,null,null,null,null,null,null,null,null,null,null,null,296,8.2222222222222228E-3,-0.89879404629916704,-0.89879404629916704,null,8.2222222222222214]
[null,null,null,null,null,null,null,null,null,null,null,null,null,null,null,null,null,null,null,null,297,8.2500000000000004E-3,-0.89100652418836757,-0.89100652418836757,null,8.25]
[null,null,null,null,null,null,null,null,null,null,null,null,null,null,null,null,null,null,null,null,298,8.277777777777778E-3,-0.88294759285892677,-0.88294759285892677,null,8.2777777777777768]
[null,null,null,null,null,null,null,null,null,null,null,null,null,null,null,null,null,null,null,null,299,8.3055555555555556E-3,-0.87461970713939563,-0.87461970713939563,null,8.3055555555555571]
[null,null,null,null,null,null,null,null,null,null,null,null,null,null,null,null,null,null,null,null,300,8.3333333333333332E-3,-0.8660254037844386,-0.8660254037844386,null,8.3333333333333339]
[null,null,null,null,null,null,null,null,null,null,null,null,null,null,null,null,null,null,null,null,301,8.3611111111111108E-3,-0.85716730070211233,-0.85716730070211233,null,8.3611111111111107]
[null,null,null,null,null,null,null,null,null,null,null,null,null,null,null,null,null,null,null,null,302,8.3888888888888884E-3,-0.84804809615642618,-0.84804809615642618,null,8.3888888888888893]
[null,null,null,null,null,null,null,null,null,null,null,null,null,null,null,null,null,null,null,null,303,8.4166666666666678E-3,-0.83867056794542383,-0.83867056794542383,null,8.4166666666666661]
[null,null,null,null,null,null,null,null,null,null,null,null,null,null,null,null,null,null,null,null,304,8.4444444444444454E-3,-0.82903757255504162,-0.82903757255504162,null,8.4444444444444446]
[null,null,null,null,null,null,null,null,null,null,null,null,null,null,null,null,null,null,null,null,305,8.472222222222223E-3,-0.81915204428899124,-0.81915204428899124,null,8.4722222222222214]
[null,null,null,null,null,null,null,null,null,null,null,null,null,null,null,null,null,null,null,null,306,8.5000000000000006E-3,-0.80901699437494701,-0.80901699437494701,null,8.5]
[null,null,null,null,null,null,null,null,null,null,null,null,null,null,null,null,null,null,null,null,307,8.5277777777777782E-3,-0.79863551004729261,-0.79863551004729261,null,8.5277777777777768]
[null,null,null,null,null,null,null,null,null,null,null,null,null,null,null,null,null,null,null,null,308,8.5555555555555558E-3,-0.78801075360672179,-0.78801075360672179,null,8.5555555555555554]
[null,null,null,null,null,null,null,null,null,null,null,null,null,null,null,null,null,null,null,null,309,8.5833333333333334E-3,-0.77714596145697079,-0.77714596145697079,null,8.5833333333333321]
[null,null,null,null,null,null,null,null,null,null,null,null,null,null,null,null,null,null,null,null,310,8.611111111111111E-3,-0.76604444311897812,-0.76604444311897812,null,8.6111111111111125]
[null,null,null,null,null,null,null,null,null,null,null,null,null,null,null,null,null,null,null,null,311,8.6388888888888887E-3,-0.75470958022277224,-0.75470958022277224,null,8.6388888888888893]
[null,null,null,null,null,null,null,null,null,null,null,null,null,null,null,null,null,null,null,null,312,8.666666666666668E-3,-0.74314482547739336,-0.74314482547739336,null,8.6666666666666679]
[null,null,null,null,null,null,null,null,null,null,null,null,null,null,null,null,null,null,null,null,313,8.6944444444444456E-3,-0.73135370161916979,-0.73135370161916979,null,8.6944444444444446]
[null,null,null,null,null,null,null,null,null,null,null,null,null,null,null,null,null,null,null,null,314,8.7222222222222232E-3,-0.71933980033865053,-0.71933980033865053,null,8.7222222222222232]
[null,null,null,null,null,null,null,null,null,null,null,null,null,null,null,null,null,null,null,null,315,8.7500000000000008E-3,-0.70710678118654702,-0.70710678118654702,null,8.75]
[null,null,null,null,null,null,null,null,null,null,null,null,null,null,null,null,null,null,null,null,316,8.7777777777777784E-3,-0.69465837045899692,-0.69465837045899692,null,8.7777777777777768]
[null,null,null,null,null,null,null,null,null,null,null,null,null,null,null,null,null,null,null,null,317,8.8055555555555561E-3,-0.68199836006249825,-0.68199836006249825,null,8.8055555555555554]
[null,null,null,null,null,null,null,null,null,null,null,null,null,null,null,null,null,null,null,null,318,8.8333333333333337E-3,-0.66913060635885813,-0.66913060635885813,null,8.8333333333333321]
[null,null,null,null,null,null,null,null,null,null,null,null,null,null,null,null,null,null,null,null,319,8.8611111111111113E-3,-0.65605902899050739,-0.65605902899050739,null,8.8611111111111107]
[null,null,null,null,null,null,null,null,null,null,null,null,null,null,null,null,null,null,null,null,320,8.8888888888888889E-3,-0.64278760968653958,-0.64278760968653958,null,8.8888888888888875]
[null,null,null,null,null,null,null,null,null,null,null,null,null,null,null,null,null,null,null,null,321,{"$f":"(U323/360)*R$2","v":8.9166666666666682E-3},{"$f":"SIN((((2*PI())*$D$4)*($V323-($D$6/1000)))+$R$1)","v":-0.6293203910498365},{"$f":"SIN((((2*PI())*$F$4)*($V323-($F$6/1000)))+$R$3)","v":-0.6293203910498365},null,{"$f":"1000*($U323/360)*$R$2","v":8.9166666666666679}]
[null,null,null,null,null,null,null,null,null,null,null,null,null,null,null,null,null,null,null,null,322,8.9444444444444458E-3,-0.6156614753256574,-0.6156614753256574,null,8.9444444444444446]
[null,null,null,null,null,null,null,null,null,null,null,null,null,null,null,null,null,null,null,null,{"$f":"U324+1","v":323},8.9722222222222234E-3,-0.6018150231520476,-0.6018150231520476,null,8.9722222222222232]
[null,null,null,null,null,null,null,null,null,null,null,null,null,null,null,null,null,null,null,null,324,9.0000000000000011E-3,-0.58778525229247258,-0.58778525229247258,null,9]
[null,null,null,null,null,null,null,null,null,null,null,null,null,null,null,null,null,null,null,null,325,9.0277777777777787E-3,-0.57357643635104572,-0.57357643635104572,null,9.0277777777777786]
[null,null,null,null,null,null,null,null,null,null,null,null,null,null,null,null,null,null,null,null,326,9.0555555555555563E-3,-0.55919290347074657,-0.55919290347074657,null,9.0555555555555554]
[null,null,null,null,null,null,null,null,null,null,null,null,null,null,null,null,null,null,null,null,327,9.0833333333333339E-3,-0.54463903501502697,-0.54463903501502697,null,9.0833333333333339]
[null,null,null,null,null,null,null,null,null,null,null,null,null,null,null,null,null,null,null,null,328,9.1111111111111115E-3,-0.52991926423320501,-0.52991926423320501,null,9.1111111111111107]
[null,null,null,null,null,null,null,null,null,null,null,null,null,null,null,null,null,null,null,null,329,9.1388888888888891E-3,-0.51503807491005371,-0.51503807491005371,null,9.1388888888888893]
[null,null,null,null,null,null,null,null,null,null,null,null,null,null,null,null,null,null,null,null,330,9.1666666666666667E-3,-0.49999999999999967,-0.49999999999999967,null,9.1666666666666661]
[null,null,null,null,null,null,null,null,null,null,null,null,null,null,null,null,null,null,null,null,331,9.1944444444444443E-3,-0.48480962024633689,-0.48480962024633689,null,9.1944444444444429]
[null,null,null,null,null,null,null,null,null,null,null,null,null,null,null,null,null,null,null,null,332,9.2222222222222237E-3,-0.46947156278589003,-0.46947156278589003,null,9.2222222222222232]
[null,null,null,null,null,null,null,null,null,null,null,null,null,null,null,null,null,null,null,null,333,9.2500000000000013E-3,-0.45399049973954619,-0.45399049973954619,null,9.25]
[null,null,null,null,null,null,null,null,null,null,null,null,null,null,null,null,null,null,null,null,334,9.2777777777777789E-3,-0.43837114678907702,-0.43837114678907702,null,9.2777777777777786]
[null,null,null,null,null,null,null,null,null,null,null,null,null,null,null,null,null,null,null,null,335,9.3055555555555565E-3,-0.42261826174069922,-0.42261826174069922,null,9.3055555555555554]
[null,null,null,null,null,null,null,null,null,null,null,null,null,null,null,null,null,null,null,null,336,9.3333333333333341E-3,-0.40673664307579932,-0.40673664307579932,null,9.3333333333333339]
[null,null,null,null,null,null,null,null,null,null,null,null,null,null,null,null,null,null,null,null,337,9.3611111111111117E-3,-0.39073112848927305,-0.39073112848927305,null,9.3611111111111107]
[null,null,null,null,null,null,null,null,null,null,null,null,null,null,null,null,null,null,null,null,338,9.3888888888888893E-3,-0.37460659341591152,-0.37460659341591152,null,9.3888888888888893]
[null,null,null,null,null,null,null,null,null,null,null,null,null,null,null,null,null,null,null,null,339,9.4166666666666669E-3,-0.35836794954529994,-0.35836794954529994,null,9.4166666666666661]
[null,null,null,null,null,null,null,null,null,null,null,null,null,null,null,null,null,null,null,null,340,9.4444444444444445E-3,-0.3420201433256686,-0.3420201433256686,null,9.4444444444444446]
[null,null,null,null,null,null,null,null,null,null,null,null,null,null,null,null,null,null,null,null,341,9.4722222222222222E-3,-0.3255681544571567,-0.3255681544571567,null,9.4722222222222214]
[null,null,null,null,null,null,null,null,null,null,null,null,null,null,null,null,null,null,null,null,342,9.4999999999999998E-3,-0.30901699437494762,-0.30901699437494762,null,9.5]
[null,null,null,null,null,null,null,null,null,null,null,null,null,null,null,null,null,null,null,null,343,9.5277777777777774E-3,-0.29237170472273716,-0.29237170472273716,null,9.5277777777777768]
[null,null,null,null,null,null,null,null,null,null,null,null,null,null,null,null,null,null,null,null,344,9.5555555555555567E-3,-0.27563735581699811,-0.27563735581699811,null,9.5555555555555571]
[null,null,null,null,null,null,null,null,null,null,null,null,null,null,null,null,null,null,null,null,345,9.5833333333333343E-3,-0.25881904510251985,-0.25881904510251985,null,9.5833333333333339]
[null,null,null,null,null,null,null,null,null,null,null,null,null,null,null,null,null,null,null,null,346,9.6111111111111119E-3,-0.24192189559966698,-0.24192189559966698,null,9.6111111111111107]
[null,null,null,null,null,null,null,null,null,null,null,null,null,null,null,null,null,null,null,null,347,9.6388888888888895E-3,-0.22495105434386445,-0.22495105434386445,null,9.6388888888888893]
[null,null,null,null,null,null,null,null,null,null,null,null,null,null,null,null,null,null,null,null,348,9.6666666666666672E-3,-0.20791169081775898,-0.20791169081775898,null,9.6666666666666661]
[null,null,null,null,null,null,null,null,null,null,null,null,null,null,null,null,null,null,null,null,349,9.6944444444444448E-3,-0.19080899537654467,-0.19080899537654467,null,9.6944444444444446]
[null,null,null,null,null,null,null,null,null,null,null,null,null,null,null,null,null,null,null,null,350,9.7222222222222224E-3,-0.17364817766693039,-0.17364817766693039,null,9.7222222222222214]
[null,null,null,null,null,null,null,null,null,null,null,null,null,null,null,null,null,null,null,null,351,9.75E-3,-0.15643446504023112,-0.15643446504023112,null,9.75]
[null,null,null,null,null,null,null,null,null,null,null,null,null,null,null,null,null,null,null,null,352,9.7777777777777776E-3,-0.13917310096006588,-0.13917310096006588,null,9.7777777777777768]
[null,null,null,null,null,null,null,null,null,null,null,null,null,null,null,null,null,null,null,null,353,9.8055555555555552E-3,-0.12186934340514723,-0.12186934340514723,null,9.8055555555555554]
[null,null,null,null,null,null,null,null,null,null,null,null,null,null,null,null,null,null,null,null,354,9.8333333333333328E-3,-0.10452846326765342,-0.10452846326765342,null,9.8333333333333321]
[null,null,null,null,null,null,null,null,null,null,null,null,null,null,null,null,null,null,null,null,355,9.8611111111111122E-3,-8.715574274765743E-2,-8.715574274765743E-2,null,9.8611111111111125]
[null,null,null,null,null,null,null,null,null,null,null,null,null,null,null,null,null,null,null,null,356,9.8888888888888898E-3,-6.9756473744124761E-2,-6.9756473744124761E-2,null,9.8888888888888893]
[null,null,null,null,null,null,null,null,null,null,null,null,null,null,null,null,null,null,null,null,357,9.9166666666666674E-3,-5.2335956242943481E-2,-5.2335956242943481E-2,null,9.9166666666666679]
[null,null,null,null,null,null,null,null,null,null,null,null,null,null,null,null,null,null,null,null,358,9.944444444444445E-3,-3.4899496702500823E-2,-3.4899496702500823E-2,null,9.9444444444444446]
[null,null,null,null,null,null,null,null,null,null,null,null,null,null,null,null,null,null,null,null,359,9.9722222222222226E-3,-1.745240643728356E-2,-1.745240643728356E-2,null,9.9722222222222232]
[null,null,null,null,null,null,null,null,null,null,null,null,null,null,null,null,null,null,null,null,{"$f":"U361+1","v":360},0.01,-2.45029690981724E-16,-2.45029690981724E-16,null,10]

{"sheet":"c","index":4,"n_rows":1095,"n_cols":32,"rows_kept":1095,"cut":false,"hidden":true,"merged":[[0,18,0,20]]}
["circle engine",null,null,null,null,null,null,null,"Programming notes",null,null,null,null,null,null,"No.","Sound Sources","Phase shift",{"$f":"IF(Calculator!Z1=\"feet\",\"pos-feet\",IF(Calculator!Z1=\"meters\",\"pos-meters\",\"--\"))","v":"pos-feet"},null,null,"Polarity","Delay (s)","Attenuation",null,null,"Freq","Amp","Phase"]
["point of origin",null,null,null,null,null,null,null,null,null,null,null,null,null,null,null,null,"(rad)","x","y","z","+/-"]
["a",{"$f":"Calculator!$C$16","v":0},null,"frequency",{"$f":"Calculator!$C$34","v":100},null,null,null,"# of calculated angle",null,null,{"$f":"360/$B$6","v":72},null,null,null,1,0,{"$f":"RADIANS(Calculator!$C22)","v":0},{"$f":"IF(Calculator!$Z$1=\"feet\",Calculator!D22/12,IF(Calculator!$Z$1=\"meters\",Calculator!D22/100,\"--\"))","v":0},{"$f":"IF(Calculator!$Z$1=\"feet\",Calculator!E22/12,IF(Calculator!$Z$1=\"meters\",Calculator!E22/100,\"--\"))","v":0},{"$f":"IF(Calculator!$Z$1=\"feet\",Calculator!F22/12,IF(Calculator!$Z$1=\"meters\",Calculator!F22/100,\"--\"))","v":0},1,{"$f":"Calculator!H22*(1/1000)","v":0},{"$f":"10^(ABS(Calculator!I22)/20)","v":1}]
["b",{"$f":"Calculator!$C$17","v":0},null,null,null,null,null,null,"Pi value",null,null,{"$f":"PI()","v":3.1415926535897931},null,null,null,2,0,{"$f":"RADIANS(Calculator!$C23)","v":0},{"$f":"IF(Calculator!$Z$1=\"feet\",Calculator!D23/12,IF(Calculator!$Z$1=\"meters\",Calculator!D23/100,\"--\"))","v":0},{"$f":"IF(Calculator!$Z$1=\"feet\",Calculator!E23/12,IF(Calculator!$Z$1=\"meters\",Calculator!E23/100,\"--\"))","v":0},{"$f":"IF(Calculator!$Z$1=\"feet\",Calculator!F23/12,IF(Calculator!$Z$1=\"meters\",Calculator!F23/100,\"--\"))","v":0},1,{"$f":"Calculator!H23*(1/1000)","v":0},{"$f":"10^(ABS(Calculator!I23)/20)","v":1}]
["radius",{"$f":"Calculator!$C$15","v":40},null,null,null,null,null,null,null,null,null,null,null,null,null,3,0,{"$f":"RADIANS(Calculator!$C24)","v":0},{"$f":"IF(Calculator!$Z$1=\"feet\",Calculator!D24/12,IF(Calculator!$Z$1=\"meters\",Calculator!D24/100,\"--\"))","v":0},{"$f":"IF(Calculator!$Z$1=\"feet\",Calculator!E24/12,IF(Calculator!$Z$1=\"meters\",Calculator!E24/100,\"--\"))","v":0},{"$f":"IF(Calculator!$Z$1=\"feet\",Calculator!F24/12,IF(Calculator!$Z$1=\"meters\",Calculator!F24/100,\"--\"))","v":0},1,{"$f":"Calculator!H24*(1/1000)","v":0},{"$f":"10^(ABS(Calculator!I24)/20)","v":1}]
["angle",{"$f":"Calculator!$Z$2","v":5},"deg",null,null,null,null,null,null,null,null,null,null,null,null,4,0,{"$f":"RADIANS(Calculator!$C25)","v":0},{"$f":"IF(Calculator!$Z$1=\"feet\",Calculator!D25/12,IF(Calculator!$Z$1=\"meters\",Calculator!D25/100,\"--\"))","v":0},{"$f":"IF(Calculator!$Z$1=\"feet\",Calculator!E25/12,IF(Calculator!$Z$1=\"meters\",Calculator!E25/100,\"--\"))","v":0},{"$f":"IF(Calculator!$Z$1=\"feet\",Calculator!F25/12,IF(Calculator!$Z$1=\"meters\",Calculator!F25/100,\"--\"))","v":0},1,{"$f":"Calculator!H25*(1/1000)","v":0},{"$f":"10^(ABS(Calculator!I25)/20)","v":1}]
["c",{"$f":"Calculator!$C$18","v":0},null,null,null,null,null,null,null,null,null,null,null,null,null,5,0,{"$f":"RADIANS(Calculator!$C26)","v":0},{"$f":"IF(Calculator!$Z$1=\"feet\",Calculator!D26/12,IF(Calculator!$Z$1=\"meters\",Calculator!D26/100,\"--\"))","v":0},{"$f":"IF(Calculator!$Z$1=\"feet\",Calculator!E26/12,IF(Calculator!$Z$1=\"meters\",Calculator!E26/100,\"--\"))","v":0},{"$f":"IF(Calculator!$Z$1=\"feet\",Calculator!F26/12,IF(Calculator!$Z$1=\"meters\",Calculator!F26/100,\"--\"))","v":0},1,{"$f":"Calculator!H26*(1/1000)","v":0},{"$f":"10^(ABS(Calculator!I26)/20)","v":1}]
["speed",{"$f":"Calculator!C14","v":1128.116267261491},null,null,null,null,null,null,null,null,null,null,null,null,null,6,0,{"$f":"RADIANS(Calculator!$C27)","v":0},{"$f":"IF(Calculator!$Z$1=\"feet\",Calculator!D27/12,IF(Calculator!$Z$1=\"meters\",Calculator!D27/100,\"--\"))","v":0},{"$f":"IF(Calculator!$Z$1=\"feet\",Calculator!E27/12,IF(Calculator!$Z$1=\"meters\",Calculator!E27/100,\"--\"))","v":0},{"$f":"IF(Calculator!$Z$1=\"feet\",Calculator!F27/12,IF(Calculator!$Z$1=\"meters\",Calculator!F27/100,\"--\"))","v":0},1,{"$f":"Calculator!H27*(1/1000)","v":0},{"$f":"10^(ABS(Calculator!I27)/20)","v":1}]
["Distance position",null,null,null,null,null,null,null,null,null,null,null,null,null,null,7,0,{"$f":"RADIANS(Calculator!$C28)","v":0},{"$f":"IF(Calculator!$Z$1=\"feet\",Calculator!D28/12,IF(Calculator!$Z$1=\"meters\",Calculator!D28/100,\"--\"))","v":0},{"$f":"IF(Calculator!$Z$1=\"feet\",Calculator!E28/12,IF(Calculator!$Z$1=\"meters\",Calculator!E28/100,\"--\"))","v":0},{"$f":"IF(Calculator!$Z$1=\"feet\",Calculator!F28/12,IF(Calculator!$Z$1=\"meters\",Calculator!F28/100,\"--\"))","v":0},1,{"$f":"Calculator!H28*(1/1000)","v":0},{"$f":"10^(ABS(Calculator!I28)/20)","v":1}]
["angle","x","y","z","Amplitude squared","Log Amplitude","Normalized","Ref Distance","bandmin","bandcen","bandmax","average","squared","Log amp",null,8,0,{"$f":"RADIANS(Calculator!$C29)","v":0},{"$f":"IF(Calculator!$Z$1=\"feet\",Calculator!D29/12,IF(Calculator!$Z$1=\"meters\",Calculator!D29/100,\"--\"))","v":0},{"$f":"IF(Calculator!$Z$1=\"feet\",Calculator!E29/12,IF(Calculator!$Z$1=\"meters\",Calculator!E29/100,\"--\"))","v":0},{"$f":"IF(Calculator!$Z$1=\"feet\",Calculator!F29/12,IF(Calculator!$Z$1=\"meters\",Calculator!F29/100,\"--\"))","v":0},1,{"$f":"Calculator!H29*(1/1000)","v":0},{"$f":"10^(ABS(Calculator!I29)/20)","v":1},null,null,null,null,null,null,null,"AF10-AK10 are reserved!!"]
[null,null,null,null,null,null,null,null,null,null,null,{"$f":"AVERAGE(I11:K11)","v":{"$error":"#DIV/0!"}},{"$f":"L11^2","v":{"$error":"#DIV/0!"}},{"$f":"IF(M11<>0,5*LOG10(M11),-1000)","v":{"$error":"#DIV/0!"}},null,9,0,{"$f":"RADIANS(Calculator!$C30)","v":0},{"$f":"IF(Calculator!$Z$1=\"feet\",Calculator!D30/12,IF(Calculator!$Z$1=\"meters\",Calculator!D30/100,\"--\"))","v":0},{"$f":"IF(Calculator!$Z$1=\"feet\",Calculator!E30/12,IF(Calculator!$Z$1=\"meters\",Calculator!E30/100,\"--\"))","v":0},{"$f":"IF(Calculator!$Z$1=\"feet\",Calculator!F30/12,IF(Calculator!$Z$1=\"meters\",Calculator!F30/100,\"--\"))","v":0},1,{"$f":"Calculator!H30*(1/1000)","v":0},{"$f":"10^(ABS(Calculator!I30)/20)","v":1}]
[null,null,null,null,null,null,null,null,null,null,null,{"$f":"AVERAGE(I12:K12)","v":{"$error":"#DIV/0!"}},{"$f":"L12^2","v":{"$error":"#DIV/0!"}},{"$f":"IF(M12<>0,5*LOG10(M12),-1000)","v":{"$error":"#DIV/0!"}},null,10,0,{"$f":"RADIANS(Calculator!$C31)","v":0},{"$f":"IF(Calculator!$Z$1=\"feet\",Calculator!D31/12,IF(Calculator!$Z$1=\"meters\",Calculator!D31/100,\"--\"))","v":0},{"$f":"IF(Calculator!$Z$1=\"feet\",Calculator!E31/12,IF(Calculator!$Z$1=\"meters\",Calculator!E31/100,\"--\"))","v":0},{"$f":"IF(Calculator!$Z$1=\"feet\",Calculator!F31/12,IF(Calculator!$Z$1=\"meters\",Calculator!F31/100,\"--\"))","v":0},1,{"$f":"Calculator!H31*(1/1000)","v":0},{"$f":"10^(ABS(Calculator!I31)/20)","v":1}]
[null,null,null,null,null,null,null,null,null,null,null,{"$error":"#DIV/0!"},{"$error":"#DIV/0!"},{"$error":"#DIV/0!"}]
[null,null,null,null,null,null,null,null,null,null,null,{"$error":"#DIV/0!"},{"$error":"#DIV/0!"},{"$error":"#DIV/0!"}]
[null,null,null,null,null,null,null,null,null,null,null,{"$error":"#DIV/0!"},{"$error":"#DIV/0!"},{"$error":"#DIV/0!"}]
[null,null,null,null,null,null,null,null,null,null,null,{"$error":"#DIV/0!"},{"$error":"#DIV/0!"},{"$error":"#DIV/0!"}]
[null,null,null,null,null,null,null,null,null,null,null,{"$error":"#DIV/0!"},{"$error":"#DIV/0!"},{"$error":"#DIV/0!"}]
[null,null,null,null,null,null,null,null,null,null,null,{"$error":"#DIV/0!"},{"$error":"#DIV/0!"},{"$error":"#DIV/0!"}]
[null,null,null,null,null,null,null,null,null,null,null,{"$error":"#DIV/0!"},{"$error":"#DIV/0!"},{"$error":"#DIV/0!"}]
[null,null,null,null,null,null,null,null,null,null,null,{"$error":"#DIV/0!"},{"$error":"#DIV/0!"},{"$error":"#DIV/0!"}]
[null,null,null,null,null,null,null,null,null,null,null,{"$error":"#DIV/0!"},{"$error":"#DIV/0!"},{"$error":"#DIV/0!"}]
[null,null,null,null,null,null,null,null,null,null,null,{"$error":"#DIV/0!"},{"$error":"#DIV/0!"},{"$error":"#DIV/0!"}]
[null,null,null,null,null,null,null,null,null,null,null,{"$error":"#DIV/0!"},{"$error":"#DIV/0!"},{"$error":"#DIV/0!"}]
[null,null,null,null,null,null,null,null,null,null,null,{"$error":"#DIV/0!"},{"$error":"#DIV/0!"},{"$error":"#DIV/0!"}]
[null,null,null,null,null,null,null,null,null,null,null,{"$error":"#DIV/0!"},{"$error":"#DIV/0!"},{"$error":"#DIV/0!"}]
[null,null,null,null,null,null,null,null,null,null,null,{"$error":"#DIV/0!"},{"$error":"#DIV/0!"},{"$error":"#DIV/0!"}]
[null,null,null,null,null,null,null,null,null,null,null,{"$error":"#DIV/0!"},{"$error":"#DIV/0!"},{"$error":"#DIV/0!"}]
[null,null,null,null,null,null,null,null,null,null,null,{"$error":"#DIV/0!"},{"$error":"#DIV/0!"},{"$error":"#DIV/0!"}]
[null,null,null,null,null,null,null,null,null,null,null,{"$error":"#DIV/0!"},{"$error":"#DIV/0!"},{"$error":"#DIV/0!"}]
[null,null,null,null,null,null,null,null,null,null,null,{"$error":"#DIV/0!"},{"$error":"#DIV/0!"},{"$error":"#DIV/0!"}]
[null,null,null,null,null,null,null,null,null,null,null,{"$error":"#DIV/0!"},{"$error":"#DIV/0!"},{"$error":"#DIV/0!"}]
[null,null,null,null,null,null,null,null,null,null,null,{"$error":"#DIV/0!"},{"$error":"#DIV/0!"},{"$error":"#DIV/0!"}]
[null,null,null,null,null,null,null,null,null,null,null,{"$error":"#DIV/0!"},{"$error":"#DIV/0!"},{"$error":"#DIV/0!"}]
[null,null,null,null,null,null,null,null,null,null,null,{"$error":"#DIV/0!"},{"$error":"#DIV/0!"},{"$error":"#DIV/0!"}]
[null,null,null,null,null,null,null,null,null,null,null,{"$error":"#DIV/0!"},{"$error":"#DIV/0!"},{"$error":"#DIV/0!"}]
[null,null,null,null,null,null,null,null,null,null,null,{"$error":"#DIV/0!"},{"$error":"#DIV/0!"},{"$error":"#DIV/0!"}]
[null,null,null,null,null,null,null,null,null,null,null,{"$error":"#DIV/0!"},{"$error":"#DIV/0!"},{"$error":"#DIV/0!"}]
[null,null,null,null,null,null,null,null,null,null,null,{"$error":"#DIV/0!"},{"$error":"#DIV/0!"},{"$error":"#DIV/0!"}]
[null,null,null,null,null,null,null,null,null,null,null,{"$error":"#DIV/0!"},{"$error":"#DIV/0!"},{"$error":"#DIV/0!"}]
[null,null,null,null,null,null,null,null,null,null,null,{"$error":"#DIV/0!"},{"$error":"#DIV/0!"},{"$error":"#DIV/0!"}]
[null,null,null,null,null,null,null,null,null,null,null,{"$error":"#DIV/0!"},{"$error":"#DIV/0!"},{"$error":"#DIV/0!"}]
[null,null,null,null,null,null,null,null,null,null,null,{"$error":"#DIV/0!"},{"$error":"#DIV/0!"},{"$error":"#DIV/0!"}]
[null,null,null,null,null,null,null,null,null,null,null,{"$error":"#DIV/0!"},{"$error":"#DIV/0!"},{"$error":"#DIV/0!"}]
[null,null,null,null,null,null,null,null,null,null,null,{"$error":"#DIV/0!"},{"$error":"#DIV/0!"},{"$error":"#DIV/0!"}]
[null,null,null,null,null,null,null,null,null,null,null,{"$error":"#DIV/0!"},{"$error":"#DIV/0!"},{"$error":"#DIV/0!"}]
[null,null,null,null,null,null,null,null,null,null,null,{"$error":"#DIV/0!"},{"$error":"#DIV/0!"},{"$error":"#DIV/0!"}]
[null,null,null,null,null,null,null,null,null,null,null,{"$error":"#DIV/0!"},{"$error":"#DIV/0!"},{"$error":"#DIV/0!"}]
[null,null,null,null,null,null,null,null,null,null,null,{"$error":"#DIV/0!"},{"$error":"#DIV/0!"},{"$error":"#DIV/0!"}]
[null,null,null,null,null,null,null,null,null,null,null,{"$error":"#DIV/0!"},{"$error":"#DIV/0!"},{"$error":"#DIV/0!"}]
[null,null,null,null,null,null,null,null,null,null,null,{"$error":"#DIV/0!"},{"$error":"#DIV/0!"},{"$error":"#DIV/0!"}]
[null,null,null,null,null,null,null,null,null,null,null,{"$error":"#DIV/0!"},{"$error":"#DIV/0!"},{"$error":"#DIV/0!"}]
[null,null,null,null,null,null,null,null,null,null,null,{"$error":"#DIV/0!"},{"$error":"#DIV/0!"},{"$error":"#DIV/0!"}]
[null,null,null,null,null,null,null,null,null,null,null,{"$error":"#DIV/0!"},{"$error":"#DIV/0!"},{"$error":"#DIV/0!"}]
[null,null,null,null,null,null,null,null,null,null,null,{"$error":"#DIV/0!"},{"$error":"#DIV/0!"},{"$error":"#DIV/0!"}]
[null,null,null,null,null,null,null,null,null,null,null,{"$error":"#DIV/0!"},{"$error":"#DIV/0!"},{"$error":"#DIV/0!"}]
[null,null,null,null,null,null,null,null,null,null,null,{"$error":"#DIV/0!"},{"$error":"#DIV/0!"},{"$error":"#DIV/0!"}]
[null,null,null,null,null,null,null,null,null,null,null,{"$error":"#DIV/0!"},{"$error":"#DIV/0!"},{"$error":"#DIV/0!"}]
[null,null,null,null,null,null,null,null,null,null,null,{"$error":"#DIV/0!"},{"$error":"#DIV/0!"},{"$error":"#DIV/0!"}]
[null,null,null,null,null,null,null,null,null,null,null,{"$error":"#DIV/0!"},{"$error":"#DIV/0!"},{"$error":"#DIV/0!"}]
[null,null,null,null,null,null,null,null,null,null,null,{"$error":"#DIV/0!"},{"$error":"#DIV/0!"},{"$error":"#DIV/0!"}]
[null,null,null,null,null,null,null,null,null,null,null,{"$error":"#DIV/0!"},{"$error":"#DIV/0!"},{"$error":"#DIV/0!"}]
[null,null,null,null,null,null,null,null,null,null,null,{"$error":"#DIV/0!"},{"$error":"#DIV/0!"},{"$error":"#DIV/0!"}]
[null,null,null,null,null,null,null,null,null,null,null,{"$error":"#DIV/0!"},{"$error":"#DIV/0!"},{"$error":"#DIV/0!"}]
[null,null,null,null,null,null,null,null,null,null,null,{"$error":"#DIV/0!"},{"$error":"#DIV/0!"},{"$error":"#DIV/0!"}]
[null,null,null,null,null,null,null,null,null,null,null,{"$error":"#DIV/0!"},{"$error":"#DIV/0!"},{"$error":"#DIV/0!"}]
[null,null,null,null,null,null,null,null,null,null,null,{"$error":"#DIV/0!"},{"$error":"#DIV/0!"},{"$error":"#DIV/0!"}]
[null,null,null,null,null,null,null,null,null,null,null,{"$error":"#DIV/0!"},{"$error":"#DIV/0!"},{"$error":"#DIV/0!"}]
[null,null,null,null,null,null,null,null,null,null,null,{"$error":"#DIV/0!"},{"$error":"#DIV/0!"},{"$error":"#DIV/0!"}]
[null,null,null,null,null,null,null,null,null,null,null,{"$error":"#DIV/0!"},{"$error":"#DIV/0!"},{"$error":"#DIV/0!"}]
[null,null,null,null,null,null,null,null,null,null,null,{"$error":"#DIV/0!"},{"$error":"#DIV/0!"},{"$error":"#DIV/0!"}]
[null,null,null,null,null,null,null,null,null,null,null,{"$error":"#DIV/0!"},{"$error":"#DIV/0!"},{"$error":"#DIV/0!"}]
[null,null,null,null,null,null,null,null,null,null,null,{"$error":"#DIV/0!"},{"$error":"#DIV/0!"},{"$error":"#DIV/0!"}]
[null,null,null,null,null,null,null,null,null,null,null,{"$error":"#DIV/0!"},{"$error":"#DIV/0!"},{"$error":"#DIV/0!"}]
[null,null,null,null,null,null,null,null,null,null,null,{"$error":"#DIV/0!"},{"$error":"#DIV/0!"},{"$error":"#DIV/0!"}]
[null,null,null,null,null,null,null,null,null,null,null,{"$error":"#DIV/0!"},{"$error":"#DIV/0!"},{"$error":"#DIV/0!"}]
[null,null,null,null,null,null,null,null,null,null,null,{"$f":"AVERAGE(I76:K76)","v":{"$error":"#DIV/0!"}},{"$f":"L76^2","v":{"$error":"#DIV/0!"}},{"$f":"IF(M76<>0,5*LOG10(M76),-1000)","v":{"$error":"#DIV/0!"}}]
[null,null,null,null,null,null,null,null,null,null,null,{"$error":"#DIV/0!"},{"$error":"#DIV/0!"},{"$error":"#DIV/0!"}]
[null,null,null,null,null,null,null,null,null,null,null,{"$error":"#DIV/0!"},{"$error":"#DIV/0!"},{"$error":"#DIV/0!"}]
[null,null,null,null,null,null,null,null,null,null,null,{"$error":"#DIV/0!"},{"$error":"#DIV/0!"},{"$error":"#DIV/0!"}]
[null,null,null,null,null,null,null,null,null,null,null,{"$error":"#DIV/0!"},{"$error":"#DIV/0!"},{"$error":"#DIV/0!"}]
[null,null,null,null,null,null,null,null,null,null,null,{"$error":"#DIV/0!"},{"$error":"#DIV/0!"},{"$error":"#DIV/0!"}]
[null,null,null,null,null,null,null,null,null,null,null,{"$error":"#DIV/0!"},{"$error":"#DIV/0!"},{"$error":"#DIV/0!"}]
[null,null,null,null,null,null,null,null,null,null,null,{"$error":"#DIV/0!"},{"$error":"#DIV/0!"},{"$error":"#DIV/0!"}]
[null,null,null,null,null,null,null,null,null,null,null,{"$error":"#DIV/0!"},{"$error":"#DIV/0!"},{"$error":"#DIV/0!"}]
[null,null,null,null,null,null,null,null,null,null,null,{"$error":"#DIV/0!"},{"$error":"#DIV/0!"},{"$error":"#DIV/0!"}]
[null,null,null,null,null,null,null,null,null,null,null,{"$error":"#DIV/0!"},{"$error":"#DIV/0!"},{"$error":"#DIV/0!"}]
[null,null,null,null,null,null,null,null,null,null,null,{"$error":"#DIV/0!"},{"$error":"#DIV/0!"},{"$error":"#DIV/0!"}]
[null,null,null,null,null,null,null,null,null,null,null,{"$error":"#DIV/0!"},{"$error":"#DIV/0!"},{"$error":"#DIV/0!"}]
[null,null,null,null,null,null,null,null,null,null,null,{"$error":"#DIV/0!"},{"$error":"#DIV/0!"},{"$error":"#DIV/0!"}]
[null,null,null,null,null,null,null,null,null,null,null,{"$error":"#DIV/0!"},{"$error":"#DIV/0!"},{"$error":"#DIV/0!"}]
[null,null,null,null,null,null,null,null,null,null,null,{"$error":"#DIV/0!"},{"$error":"#DIV/0!"},{"$error":"#DIV/0!"}]
[null,null,null,null,null,null,null,null,null,null,null,{"$error":"#DIV/0!"},{"$error":"#DIV/0!"},{"$error":"#DIV/0!"}]
[null,null,null,null,null,null,null,null,null,null,null,{"$error":"#DIV/0!"},{"$error":"#DIV/0!"},{"$error":"#DIV/0!"}]
[null,null,null,null,null,null,null,null,null,null,null,{"$error":"#DIV/0!"},{"$error":"#DIV/0!"},{"$error":"#DIV/0!"}]
[null,null,null,null,null,null,null,null,null,null,null,{"$error":"#DIV/0!"},{"$error":"#DIV/0!"},{"$error":"#DIV/0!"}]
[null,null,null,null,null,null,null,null,null,null,null,{"$error":"#DIV/0!"},{"$error":"#DIV/0!"},{"$error":"#DIV/0!"}]
[null,null,null,null,null,null,null,null,null,null,null,{"$error":"#DIV/0!"},{"$error":"#DIV/0!"},{"$error":"#DIV/0!"}]
[null,null,null,null,null,null,null,null,null,null,null,{"$error":"#DIV/0!"},{"$error":"#DIV/0!"},{"$error":"#DIV/0!"}]
[null,null,null,null,null,null,null,null,null,null,null,{"$error":"#DIV/0!"},{"$error":"#DIV/0!"},{"$error":"#DIV/0!"}]
[null,null,null,null,null,null,null,null,null,null,null,{"$error":"#DIV/0!"},{"$error":"#DIV/0!"},{"$error":"#DIV/0!"}]
[null,null,null,null,null,null,null,null,null,null,null,{"$error":"#DIV/0!"},{"$error":"#DIV/0!"},{"$error":"#DIV/0!"}]
[null,null,null,null,null,null,null,null,null,null,null,{"$error":"#DIV/0!"},{"$error":"#DIV/0!"},{"$error":"#DIV/0!"}]
[null,null,null,null,null,null,null,null,null,null,null,{"$error":"#DIV/0!"},{"$error":"#DIV/0!"},{"$error":"#DIV/0!"}]
[null,null,null,null,null,null,null,null,null,null,null,{"$error":"#DIV/0!"},{"$error":"#DIV/0!"},{"$error":"#DIV/0!"}]
[null,null,null,null,null,null,null,null,null,null,null,{"$error":"#DIV/0!"},{"$error":"#DIV/0!"},{"$error":"#DIV/0!"}]
[null,null,null,null,null,null,null,null,null,null,null,{"$error":"#DIV/0!"},{"$error":"#DIV/0!"},{"$error":"#DIV/0!"}]
[null,null,null,null,null,null,null,null,null,null,null,{"$error":"#DIV/0!"},{"$error":"#DIV/0!"},{"$error":"#DIV/0!"}]
[null,null,null,null,null,null,null,null,null,null,null,{"$error":"#DIV/0!"},{"$error":"#DIV/0!"},{"$error":"#DIV/0!"}]
[null,null,null,null,null,null,null,null,null,null,null,{"$error":"#DIV/0!"},{"$error":"#DIV/0!"},{"$error":"#DIV/0!"}]
[null,null,null,null,null,null,null,null,null,null,null,{"$error":"#DIV/0!"},{"$error":"#DIV/0!"},{"$error":"#DIV/0!"}]
[null,null,null,null,null,null,null,null,null,null,null,{"$error":"#DIV/0!"},{"$error":"#DIV/0!"},{"$error":"#DIV/0!"}]
[null,null,null,null,null,null,null,null,null,null,null,{"$error":"#DIV/0!"},{"$error":"#DIV/0!"},{"$error":"#DIV/0!"}]
[null,null,null,null,null,null,null,null,null,null,null,{"$error":"#DIV/0!"},{"$error":"#DIV/0!"},{"$error":"#DIV/0!"}]
[null,null,null,null,null,null,null,null,null,null,null,{"$error":"#DIV/0!"},{"$error":"#DIV/0!"},{"$error":"#DIV/0!"}]
[null,null,null,null,null,null,null,null,null,null,null,{"$error":"#DIV/0!"},{"$error":"#DIV/0!"},{"$error":"#DIV/0!"}]
[null,null,null,null,null,null,null,null,null,null,null,{"$error":"#DIV/0!"},{"$error":"#DIV/0!"},{"$error":"#DIV/0!"}]
[null,null,null,null,null,null,null,null,null,null,null,{"$error":"#DIV/0!"},{"$error":"#DIV/0!"},{"$error":"#DIV/0!"}]
[null,null,null,null,null,null,null,null,null,null,null,{"$error":"#DIV/0!"},{"$error":"#DIV/0!"},{"$error":"#DIV/0!"}]
[null,null,null,null,null,null,null,null,null,null,null,{"$error":"#DIV/0!"},{"$error":"#DIV/0!"},{"$error":"#DIV/0!"}]
[null,null,null,null,null,null,null,null,null,null,null,{"$error":"#DIV/0!"},{"$error":"#DIV/0!"},{"$error":"#DIV/0!"}]
[null,null,null,null,null,null,null,null,null,null,null,{"$error":"#DIV/0!"},{"$error":"#DIV/0!"},{"$error":"#DIV/0!"}]
[null,null,null,null,null,null,null,null,null,null,null,{"$error":"#DIV/0!"},{"$error":"#DIV/0!"},{"$error":"#DIV/0!"}]
[null,null,null,null,null,null,null,null,null,null,null,{"$error":"#DIV/0!"},{"$error":"#DIV/0!"},{"$error":"#DIV/0!"}]
[null,null,null,null,null,null,null,null,null,null,null,{"$error":"#DIV/0!"},{"$error":"#DIV/0!"},{"$error":"#DIV/0!"}]
[null,null,null,null,null,null,null,null,null,null,null,{"$error":"#DIV/0!"},{"$error":"#DIV/0!"},{"$error":"#DIV/0!"}]
[null,null,null,null,null,null,null,null,null,null,null,{"$error":"#DIV/0!"},{"$error":"#DIV/0!"},{"$error":"#DIV/0!"}]
[null,null,null,null,null,null,null,null,null,null,null,{"$error":"#DIV/0!"},{"$error":"#DIV/0!"},{"$error":"#DIV/0!"}]
[null,null,null,null,null,null,null,null,null,null,null,{"$error":"#DIV/0!"},{"$error":"#DIV/0!"},{"$error":"#DIV/0!"}]
[null,null,null,null,null,null,null,null,null,null,null,{"$error":"#DIV/0!"},{"$error":"#DIV/0!"},{"$error":"#DIV/0!"}]
[null,null,null,null,null,null,null,null,null,null,null,{"$error":"#DIV/0!"},{"$error":"#DIV/0!"},{"$error":"#DIV/0!"}]
[null,null,null,null,null,null,null,null,null,null,null,{"$error":"#DIV/0!"},{"$error":"#DIV/0!"},{"$error":"#DIV/0!"}]
[null,null,null,null,null,null,null,null,null,null,null,{"$error":"#DIV/0!"},{"$error":"#DIV/0!"},{"$error":"#DIV/0!"}]
[null,null,null,null,null,null,null,null,null,null,null,{"$error":"#DIV/0!"},{"$error":"#DIV/0!"},{"$error":"#DIV/0!"}]
[null,null,null,null,null,null,null,null,null,null,null,{"$error":"#DIV/0!"},{"$error":"#DIV/0!"},{"$error":"#DIV/0!"}]
[null,null,null,null,null,null,null,null,null,null,null,{"$error":"#DIV/0!"},{"$error":"#DIV/0!"},{"$error":"#DIV/0!"}]
[null,null,null,null,null,null,null,null,null,null,null,{"$error":"#DIV/0!"},{"$error":"#DIV/0!"},{"$error":"#DIV/0!"}]
[null,null,null,null,null,null,null,null,null,null,null,{"$error":"#DIV/0!"},{"$error":"#DIV/0!"},{"$error":"#DIV/0!"}]
[null,null,null,null,null,null,null,null,null,null,null,{"$error":"#DIV/0!"},{"$error":"#DIV/0!"},{"$error":"#DIV/0!"}]
[null,null,null,null,null,null,null,null,null,null,null,{"$error":"#DIV/0!"},{"$error":"#DIV/0!"},{"$error":"#DIV/0!"}]
[null,null,null,null,null,null,null,null,null,null,null,{"$f":"AVERAGE(I140:K140)","v":{"$error":"#DIV/0!"}},{"$f":"L140^2","v":{"$error":"#DIV/0!"}},{"$f":"IF(M140<>0,5*LOG10(M140),-1000)","v":{"$error":"#DIV/0!"}}]
[null,null,null,null,null,null,null,null,null,null,null,{"$error":"#DIV/0!"},{"$error":"#DIV/0!"},{"$error":"#DIV/0!"}]
[null,null,null,null,null,null,null,null,null,null,null,{"$error":"#DIV/0!"},{"$error":"#DIV/0!"},{"$error":"#DIV/0!"}]
[null,null,null,null,null,null,null,null,null,null,null,{"$error":"#DIV/0!"},{"$error":"#DIV/0!"},{"$error":"#DIV/0!"}]
[null,null,null,null,null,null,null,null,null,null,null,{"$error":"#DIV/0!"},{"$error":"#DIV/0!"},{"$error":"#DIV/0!"}]
[null,null,null,null,null,null,null,null,null,null,null,{"$error":"#DIV/0!"},{"$error":"#DIV/0!"},{"$error":"#DIV/0!"}]
[null,null,null,null,null,null,null,null,null,null,null,{"$error":"#DIV/0!"},{"$error":"#DIV/0!"},{"$error":"#DIV/0!"}]
[null,null,null,null,null,null,null,null,null,null,null,{"$error":"#DIV/0!"},{"$error":"#DIV/0!"},{"$error":"#DIV/0!"}]
[null,null,null,null,null,null,null,null,null,null,null,{"$error":"#DIV/0!"},{"$error":"#DIV/0!"},{"$error":"#DIV/0!"}]
[null,null,null,null,null,null,null,null,null,null,null,{"$error":"#DIV/0!"},{"$error":"#DIV/0!"},{"$error":"#DIV/0!"}]
[null,null,null,null,null,null,null,null,null,null,null,{"$error":"#DIV/0!"},{"$error":"#DIV/0!"},{"$error":"#DIV/0!"}]
[null,null,null,null,null,null,null,null,null,null,null,{"$error":"#DIV/0!"},{"$error":"#DIV/0!"},{"$error":"#DIV/0!"}]
[null,null,null,null,null,null,null,null,null,null,null,{"$error":"#DIV/0!"},{"$error":"#DIV/0!"},{"$error":"#DIV/0!"}]
[null,null,null,null,null,null,null,null,null,null,null,{"$error":"#DIV/0!"},{"$error":"#DIV/0!"},{"$error":"#DIV/0!"}]
[null,null,null,null,null,null,null,null,null,null,null,{"$error":"#DIV/0!"},{"$error":"#DIV/0!"},{"$error":"#DIV/0!"}]
[]
[]
[]
[]
[]
[]
[]
[]
[]
[]
[]
[]
[]
[]
[]
[]
[]
[]
[]
[]
[]
[]
[]
[]
[]
[]
[]
[]
[]
[]
[]
[]
[]
[]
[]
[]
[]
[]
[]
[]
[]
[]
[]
[]
[]
[]
[]
[]
[]
[]
[]
[]
[]
[]
[]
[]
[]
[]
[]
[]
[]
[]
[]
[]
[]
[]
[]
[]
[]
[]
[]
[]
[]
[]
[]
[]
[]
[]
[]
[]
[]
[]
[]
[]
[]
[]
[]
[]
[]
[]
[]
[]
[]
[]
[]
[]
[]
[]
[]
[]
[]
[]
[]
[]
[]
[]
[]
[]
[]
[]
[]
[]
[]
[]
[]
[]
[]
[]
[]
[]
[]
[]
[]
[]
[]
[]
[]
[]
[]
[]
[]
[]
[]
[]
[]
[]
[]
[]
[]
[]
[]
[]
[]
[]
[]
[]
[]
[]
[]
[]
[]
[]
[]
[]
[]
[]
[]
[]
[]
[]
[]
[]
[]
[]
[]
[]
[]
[]
[]
[]
[]
[]
[]
[]
[]
[]
[]
[]
[]
[]
[]
[]
[]
[]
[]
[]
[]
[]
[]
[]
[]
[]
[]
[]
[]
[]
[]
[]
[]
[]
[]
[]
[]
[]
[]
[]
[]
[]
[]
[]
[]
[]
[]
[]
[]
[]
[]
[]
[]
[]
[]
[]
[]
[]
[]
[]
[]
[]
[]
[]
[]
[]
[]
[]
[]
[]
[]
[]
[]
[]
[]
[]
[]
[]
[]
[]
[]
[]
[]
[]
[]
[]
[]
[]
[]
[]
[]
[]
[]
[]
[]
[]
[]
[]
[]
[]
[]
[]
[]
[]
[]
[]
[]
[]
[]
[]
[]
[]
[]
[]
[]
[]
[]
[]
[]
[]
[]
[]
[]
[]
[]
[]
[]
[]
[]
[]
[]
[]
[]
[]
[]
[]
[]
[]
[]
[]
[]
[]
[]
[]
[]
[]
[]
[]
[]
[]
[]
[]
[]
[]
[]
[]
[]
[]
[]
[]
[]
[]
[]
[]
[]
[]
[]
[]
[]
[]
[]
[]
[]
[]
[]
[]
[]
[]
[]
[]
[]
[]
[]
[]
[]
[]
[]
[]
[]
[]
[]
[]
[]
[]
[]
[]
[]
[]
[]
[]
[]
[]
[]
[]
[]
[]
[]
[]
[]
[]
[]
[]
[]
[]
[]
[]
[]
[]
[]
[]
[]
[]
[]
[]
[]
[]
[]
[]
[]
[]
[]
[]
[]
[]
[]
[]
[]
[]
[]
[]
[]
[]
[]
[]
[]
[]
[]
[]
[]
[]
[]
[]
[]
[]
[]
[]
[]
[]
[]
[]
[]
[]
[]
[]
[]
[]
[]
[]
[]
[]
[]
[]
[]
[]
[]
[]
[]
[]
[]
[]
[]
[]
[]
[]
[]
[]
[]
[]
[]
[]
[]
[]
[]
[]
[]
[]
[]
[]
[]
[]
[]
[]
[]
[]
[]
[]
[]
[]
[]
[]
[]
[]
[]
[]
[]
[]
[]
[]
[]
[]
[]
[]
[]
[]
[]
[]
[]
[]
[]
[]
[]
[]
[]
[]
[]
[]
[]
[]
[]
[]
[]
[]
[]
[]
[]
[]
[]
[]
[]
[]
[]
[]
[]
[]
[]
[]
[]
[]
[]
[]
[]
[]
[]
[]
[]
[]
[]
[]
[]
[]
[]
[]
[]
[]
[]
[]
[]
[]
[]
[]
[]
[]
[]
[]
[]
[]
[]
[]
[]
[]
[]
[]
[]
[]
[]
[]
[]
[]
[]
[]
[]
[]
[]
[]
[]
[]
[]
[]
[]
[]
[]
[]
[]
[]
[]
[]
[]
[]
[]
[]
[]
[]
[]
[]
[]
[]
[]
[]
[]
[]
[]
[]
[]
[]
[]
[]
[]
[]
[]
[]
[]
[]
[]
[]
[]
[]
[]
[]
[]
[]
[]
[]
[]
[]
[]
[]
[]
[]
[]
[]
[]
[]
[]
[]
[]
[]
[]
[]
[]
[]
[]
[]
[]
[]
[]
[]
[]
[]
[]
[]
[]
[]
[]
[]
[]
[]
[]
[]
[]
[]
[]
[]
[]
[]
[]
[]
[]
[]
[]
[]
[]
[]
[]
[]
[]
[]
[]
[]
[]
[]
[]
[]
[]
[]
[]
[]
[]
[]
[]
[]
[]
[]
[]
[]
[]
[]
[]
[]
[]
[]
[]
[]
[]
[]
[]
[]
[]
[]
[]
[]
[]
[]
[]
[]
[]
[]
[]
[]
[]
[]
[]
[]
[]
[]
[]
[]
[]
[]
[]
[]
[]
[]
[]
[]
[]
[]
[]
[]
[]
[]
[]
[]
[]
[]
[]
[]
[]
[]
[]
[]
[]
[]
[]
[]
[]
[]
[]
[]
[]
[]
[]
[]
[]
[]
[]
[]
[]
[]
[]
[]
[]
[]
[]
[]
[]
[]
[]
[]
[]
[]
[]
[]
[]
[]
[]
[]
[]
[]
[]
[]
[]
[]
[]
[]
[]
[]
[]
[]
[]
[]
[]
[]
[]
[]
[]
[]
[]
[]
[]
[]
[]
[]
[]
[]
[]
[]
[]
[]
[]
[]
[]
[]
[]
[]
[]
[]
[]
[]
[]
[]
[]
[]
[]
[]
[]
[]
[]
[]
[]
[]
[]
[]
[]
[]
[]
[]
[]
[]
[]
[]
[]
[]
[]
[]
[]
[]
[]
[]
[]
[]
[]
[]
[]
[]
[]
[]
[]
[]
[]
[]
[]
[]
[]
[]
[]
[]
[]
[]
[]
[]
[]
[]
[]
[]
[]
[]
[]
[]
[]
[]
[]
[]
[]
[]
[]
[]
[]
[]
[]
[]
[]
[]
[]
[]
[]
[]
[]
[]
[]
[]
[]
[]
[]
[]
[]
[]
[]
[]
[]
[]
[]
[]
[]
[]
[]
[]
[]
[]
[]
[]
[]
[]
[]
[]
[]
[]
[]
[]
[]
[]
[]
[]
[]
["DEVELOPER: HADI SUMORO 2008-2009"]
["HTTP://WWW.HADISUMORO.COM"]

{"sheet":"Notes and Instructions","index":5,"n_rows":342,"n_cols":3,"rows_kept":342,"cut":false,"hidden":false,"merged":[]}
[]
[]
[]
[]
[]
[]
[]
[]
[]
[]
[null,"S u b w o o f e r   S t e e r in g   S i m u l a t i o n   S o f t w a r e"]
[null,"v1.3"]
[]
[]
[null,"Requirements"]
[null,"*","Microsoft Excel 2003 and/or 2007 (PC version)"]
[null,"*","Active content/macro has to be enabled"]
[null,null,"Excel 2003 users can activate this feature with Tools Menu > Macro > Security > (low)"]
[null,null,"Excel 2007 users will be prompted to activate the active content upon opening"]
[]
[]
[null,"Spreadsheet General Information"]
[null,"*","Adjust the zoom percentage to accommodate easier viewing."]
[null,"*","1600 x 1280 or higher screen resolution is recommended."]
[null,"*","Please do not change values in the black cells. Input cells are indicated by (dark) blue color."]
[null,"*","This Excel file contains three spreadsheets:"]
[null,"1.","Quick Start Spreadsheet"]
[null,null,"> this spreadsheet provides a quick start for the main spreadsheet (Calculator Spreadsheet)"]
[null,"2.","Calculator Spreadsheet"]
[null,null,"> 2D Polar Prediction for Multiple Point Sources Calculator"]
[null,null,"> this spreadsheet is controlled by Quick Start Spreadsheet"]
[null,"3.","Frequency Response Spreadsheet"]
[null,null,"> this spreadsheet calculates the frequency and phase response based on input values in Calculator Spreadsheet"]
[null,"4.","Informational Article"]
[]
[]
[null,"Application Notes"]
[]
[null,"1.","Community 2D Polar Prediction for Multiple Point Sources is a tool to predict sound radiation pattern based on"]
[null,null,"omnidirectional sound sources (assuming flat frequency and phase response at all frequencies)."]
[null,"2.","Averaging is calculated using three sine waves which frequency is the center-band, lower-band, and upper-band"]
[null,null,"based on the selected bandwidth average (shown in Advance mode)."]
[null,"3.","Frequency and phase response calculation are performed using Discreet Fourier Transform. Choosing a higher"]
[null,null,"frequency to plot without changing number of sample will result in lower frequency resolution (shown in Advance mode)."]
[null,"4.","All calculations are assuming freespace and no boundary loading for each point source."]
[null,"5.","Inverse square law loss due to distance is not calculated in the Frequency Response spreadsheet. Inverse Square Law"]
[null,null,"option (shown in Advance mode) is calculating SPL adjustment between the mic/listener and each loudspeaker."]
[null,"6.","To see the frequency response of the rear attenuation, go to the “Frequency Response” spreadsheet and type in a "]
[null,null,"negative distance in the “Listener Position (X)” field (the arrangement should be calculated using \"Quick Start\" spreadsheet)."]
[]
[]
[null,"Known Issues"]
[]
[null,"1.","Radio buttons/Scroll Bars cannot be selected."]
[null,null,"> Macro is not activated. Please see Instruction under \"Requirements\"."]
[null,null,"> A cell is still active, please press Enter after inputting any values in a cell."]
[null,"2.","Sliders/Scroll Bars do not change the value."]
[null,null,"> Sliders/Scroll Bars often lag in Excel, please move them more than once to change the value correctly."]
[null,"3.","Slow process in the Frequency Response spreadsheet."]
[null,null,"> The speed of the calculation is controlled by the number of samples. This control is located below the phase"]
[null,null,"   response graph. Recommended setup: Max Frequency: <500Hz, Number of Samples: 128."]
[null,null,"> Changing max frequency to plot (shown in Advance mode) will not affect the calculation speed."]
[null,"4.","Frequency Response Graph is not smooth"]
[null,null,"> Please increase the frequency resolution by decreasing the maximum frequency to plot or increasing the"]
[null,null,"   number of samples."]
[]
[]
[]
[]
[]
[]
[]
[]
[]
[]
[]
[]
[]
[]
[]
[]
[]
[]
[]
[]
[]
[]
[]
[]
[]
[]
[null,null,"Written by Hadi Sumoro"]
[null,null,"Version: 1.3 Alpha#2, Feb 2009"]
[]
[]
[]
[]
[]
[]
[]
[]
[]
[]
[]
[]
[]
[]
[]
[]
[]
[]
[]
[]
[]
[]
[]
[]
[]
[]
[]
[]
[]
[]
[]
[]
[]
[]
[]
[]
[]
[]
[]
[]
[]
[]
[]
[]
[]
[]
[]
[]
[]
[]
[]
[]
[]
[]
[]
[]
[]
[]
[]
[]
[]
[]
[]
[]
[]
[]
[]
[]
[]
[]
[]
[]
[]
[]
[]
[]
[]
[]
[]
[]
[]
[]
[]
[]
[]
[]
[]
[]
[]
[]
[]
[]
[]
[]
[]
[]
[]
[]
[]
[]
[]
[]
[]
[]
[]
[]
[]
[]
[]
[]
[]
[]
[]
[]
[]
[]
[]
[]
[]
[]
[]
[]
[]
[]
[]
[]
[]
[]
[]
[]
[]
[]
[]
[]
[]
[]
[]
[]
[]
[]
[]
[]
[]
[]
[]
[]
[]
[]
[]
[]
[]
[]
[]
[]
[]
[]
[]
[]
[]
[]
[]
[]
[]
[]
[]
[]
[]
[]
[]
[]
[]
[]
[]
[]
[]
[]
[]
[]
[]
[]
[]
[]
[]
[]
[]
[]
[]
[]
[]
[]
[]
[]
[]
[]
[]
[]
[]
[]
[]
[]
[]
[]
[]
[]
[]
[]
[]
[]
[]
[]
[]
[]
[]
[]
[]
[]
[]
[]
[]
[]
[]
[]
[]
[]
[]
[]
[]
[]
[]
[]
[]
[]
[]
[]
[]
[]
[]
[]
[]
[]
[]
[]
[]
[]
[]
[]
[]
[]
["Developer: Hadi Sumoro 2008-2009"]

{"sheet":"Info","index":6,"n_rows":137,"n_cols":39,"rows_kept":137,"cut":false,"hidden":false,"merged":[[134,1,134,3],[135,1,135,3],[136,1,136,3],[28,21,42,26],[13,9,27,14],[13,15,27,20],[13,21,27,26],[73,21,87,26],[43,1,57,8],[43,9,57,14],[43,15,57,20],[43,21,57,26],[58,1,72,8],[58,9,72,14],[58,15,72,20],[58,21,72,26],[13,38,19,38],[21,38,26,38],[10,28,10,38],[11,28,11,38],[12,28,12,38],[10,27,11,27],[10,9,10,26],[11,9,11,26],[12,9,12,14],[12,15,12,20],[12,21,12,26],[9,1,9,4],[88,1,88,4],[73,1,87,8],[73,9,87,14],[73,15,87,20],[28,1,42,8],[28,9,42,14],[28,15,42,20],[10,1,12,8],[13,1,27,8],[81,38,86,38],[73,38,79,38],[43,38,49,38],[51,38,56,38],[28,38,34,38],[36,38,41,38],[58,38,64,38],[65,38,70,38]]}
[]
[]
[]
[]
[]
[]
[]
[null,"Informational Article"]
[]
[null,"Notes and Instructions"]
[null,"Subwoofer Placement & Setup",null,null,null,null,null,null,null,"Polar Pattern",null,null,null,null,null,null,null,null,null,null,null,null,null,null,null,null,null,"Stage-Audience","Frequency Response"]
[null,null,null,null,null,null,null,null,null,"(Freespace without Boundary Loading)",null,null,null,null,null,null,null,null,null,null,null,null,null,null,null,null,null,null,"Red - Frequency Response Prediction in the Audience Area"]
[null,null,null,null,null,null,null,null,null,"50Hz",null,null,null,null,null,"80Hz",null,null,null,null,null,"110Hz",null,null,null,null,null,"Orientation","Blue - Frequency Response Prediction on the Stage"]
[null,null,null,null,null,null,null,null,null,null,null,null,null,null,null,null,null,null,null,null,null,null,null,null,null,null,null,null,null,null,null,null,null,null,null,null,null,null,"Red - 50ft away from the stage"]
[]
[]
[]
[]
[null,null,null,null,null,null,null,null,null,null,null,null,null,null,null,null,null,null,null,null,null,null,null,null,null,null,null,"Ceiling"]
[null,null,null,null,null,null,null,null,null,null,null,null,null,null,null,null,null,null,null,null,null,null,null,null,null,null,null,"Stage"]
[]
[null,null,null,null,null,null,null,null,null,null,null,null,null,null,null,null,null,null,null,null,null,null,null,null,null,null,null,"Audience",null,null,null,null,null,null,null,null,null,null,"Blue - 20ft behind the subwoofer"]
[null,null,null,null,null,null,null,null,null,null,null,null,null,null,null,null,null,null,null,null,null,null,null,null,null,null,null,"Floor"]
[]
[]
[]
[]
[]
[null,null,null,null,null,null,null,null,null,null,null,null,null,null,null,null,null,null,null,null,null,null,null,null,null,null,null,null,null,null,null,null,null,null,null,null,null,null,"Red - 50ft away from the stage"]
[]
[]
[]
[]
[null,null,null,null,null,null,null,null,null,null,null,null,null,null,null,null,null,null,null,null,null,null,null,null,null,null,null,"Ceiling"]
[null,null,null,null,null,null,null,null,null,null,null,null,null,null,null,null,null,null,null,null,null,null,null,null,null,null,null,"Stage"]
[]
[null,null,null,null,null,null,null,null,null,null,null,null,null,null,null,null,null,null,null,null,null,null,null,null,null,null,null,"Audience",null,null,null,null,null,null,null,null,null,null,"Blue - 20ft behind the sub arrangement"]
[null,null,null,null,null,null,null,null,null,null,null,null,null,null,null,null,null,null,null,null,null,null,null,null,null,null,null,"Floor"]
[]
[]
[]
[]
[]
[null,null,null,null,null,null,null,null,null,null,null,null,null,null,null,null,null,null,null,null,null,null,null,null,null,null,null,null,null,null,null,null,null,null,null,null,null,null,"Red - 50ft away from the stage"]
[]
[]
[]
[]
[null,null,null,null,null,null,null,null,null,null,null,null,null,null,null,null,null,null,null,null,null,null,null,null,null,null,null,"Ceiling"]
[null,null,null,null,null,null,null,null,null,null,null,null,null,null,null,null,null,null,null,null,null,null,null,null,null,null,null,"Stage"]
[]
[null,null,null,null,null,null,null,null,null,null,null,null,null,null,null,null,null,null,null,null,null,null,null,null,null,null,null,"Audience",null,null,null,null,null,null,null,null,null,null,"Blue - 20ft behind the sub arrangement"]
[null,null,null,null,null,null,null,null,null,null,null,null,null,null,null,null,null,null,null,null,null,null,null,null,null,null,null,"Floor"]
[]
[]
[]
[]
[]
[null,"Vertical steering calculation is not supported in Quick Start",null,null,null,null,null,null,null,null,null,null,null,null,null,null,null,null,null,null,null,null,null,null,null,null,null,null,null,null,null,null,null,null,null,null,null,null,"Red - 50ft front and 10ft below the center of the stack"]
[]
[]
[]
[]
[null,null,null,null,null,null,null,null,null,null,null,null,null,null,null,null,null,null,null,null,null,null,null,null,null,null,null,"Ceiling"]
[null,null,null,null,null,null,null,null,null,null,null,null,null,null,null,null,null,null,null,null,null,null,null,null,null,null,null,"Stage"]
[null,null,null,null,null,null,null,null,null,null,null,null,null,null,null,null,null,null,null,null,null,null,null,null,null,null,null,null,null,null,null,null,null,null,null,null,null,null,"Blue - 20ft behind the center of the stack"]
[null,null,null,null,null,null,null,null,null,null,null,null,null,null,null,null,null,null,null,null,null,null,null,null,null,null,null,"Audience"]
[null,null,null,null,null,null,null,null,null,null,null,null,null,null,null,null,null,null,null,null,null,null,null,null,null,null,null,"Floor"]
[]
[]
[]
[]
[]
[null,null,null,null,null,null,null,null,null,null,null,null,null,null,null,null,null,null,null,null,null,null,null,null,null,null,null,null,null,null,null,null,null,null,null,null,null,null,"Red - 50ft away from the stage"]
[]
[]
[]
[]
[null,null,null,null,null,null,null,null,null,null,null,null,null,null,null,null,null,null,null,null,null,null,null,null,null,null,null,"Ceiling"]
[null,null,null,null,null,null,null,null,null,null,null,null,null,null,null,null,null,null,null,null,null,null,null,null,null,null,null,"Stage"]
[]
[null,null,null,null,null,null,null,null,null,null,null,null,null,null,null,null,null,null,null,null,null,null,null,null,null,null,null,"Audience",null,null,null,null,null,null,null,null,null,null,"Blue - 20ft behind the sub arrangement"]
[null,null,null,null,null,null,null,null,null,null,null,null,null,null,null,null,null,null,null,null,null,null,null,null,null,null,null,"Floor"]
[]
[]
[]
[]
[]
[null,"Notes and Instructions"]
[]
[]
[]
[]
[]
[]
[]
[]
[]
[]
[]
[]
[]
[]
[]
[]
[]
[]
[]
[]
[]
[]
[]
[]
[]
[]
[]
[]
[]
[]
[]
[]
[]
[]
[]
[]
[]
[]
[]
[]
[]
[]
[]
[]
[]
[null,"Calculator Spreadsheet"]
[null,"Quick Start Spreadsheet"]
[null,"Notes and Instructions"]