{"text_format":"1","workbook":"xlsx","n_sheets":7,"sheets":["Quick Start","Calculator","Frequency Response","Sine Wave","c","Notes and Instructions","Info"],"not_rendered":{"charts":8,"images":134,"macros":1,"external_links":0,"defined_names":0,"comments":1,"pivot_tables":0},"unopened":[],"bounds":{"document_bytes":16777216,"sheet_cells":100000,"rows_first":2000,"rows_last":500,"rows_between":2000,"halvings":0,"cell_chars":16384,"cell_head_chars":4096},"cells_cut":0,"cells_raw":0,"read":"whole","date_system":"1900"}

{"sheet":"Quick Start","index":0,"n_rows":39,"n_cols":27,"rows_kept":39,"cut":false,"hidden":false,"merged":[[21,5,21,7],[22,5,22,7],[23,5,23,7],[24,5,24,7],[32,2,33,4],[11,5,11,7],[11,1,11,4],[23,1,23,2],[12,5,12,7],[13,5,13,7],[14,5,14,7],[15,5,15,7],[16,5,16,7],[17,5,17,7],[18,5,18,7],[19,5,19,7],[20,5,20,7]]}
[null,null,null,null,null,null,null,null,null,null,null,null,null,null,null,null,null,null,null,null,null,null,null,null,null,"feet"]
[null,null,null,null,null,null,null,null,null,null,null,null,null,null,null,null,null,null,null,null,null,null,null,null,null,1]
[null,null,null,null,null,null,null,null,null,null,null,null,null,null,null,null,null,null,null,null,null,null,null,null,null,1]
[null,null,null,null,null,null,null,null,null,null,null,null,null,null,null,null,null,null,null,null,null,null,null,null,null,4]
[null,null,null,null,null,null,null,null,null,null,null,null,null,null,null,null,null,null,null,null,null,null,null,null,null,false]
[null,null,null,null,null,null,null,null,null,null,null,null,null,null,null,null,null,null,null,null,null,null,null,null,null,50]
[null,null,null,null,null,null,null,null,null,null,null,null,null,null,null,null,null,null,null,null,null,null,null,null,null,{"$f":"($Z$6*2/100)","v":1}]
[null,null,null,null,null,null,null,null,null,null,null,null,null,null,null,null,null,null,null,null,null,null,null,null,null,{"$f":"IF(AND(Z4=2,Z3=3),2,IF(AND(Z4=4,Z3=3),1.04,IF(Z3=2,1.165,1)))","v":1}]
[null,"DSP Setting Prediction",null,null,null,null,null,null,null,null,null,null,null,null,null,null,null,null,null,null,null,null,null,null,null,141.01453340768637]
[null,"v1.3",null,null,null,null,null,null,null,null,null,null,null,null,null,null,null,null,null,null,null,null,null,null,null,null,"->empty"]
[]
[null,"DATA INPUT"]
[null,"Steered Bass Array Option",null,null,null,"Community VLF Presets"]
[null,"Unit",null,null,null,"Using One VLF Steered Array Bracket"]
[null,"Temperature",70,{"$f":"IF(Z1=\"feet\",\"F\",IF(Z1=\"meter\",\"C\",\"---\"))","v":"F"}]
[null,"Speed of Sound",{"$f":"IF(Z1=\"feet\",49.03*SQRT(459.4+C15),IF(Z1=\"meter\",20.05*SQRT(273+C15),\"---\"))","v":1128.116267261491},{"$f":"IF(Z1=\"feet\",\"ft/s\",IF(Z1=\"meter\",\"m/s\",\"---\"))","v":"ft/s"}]
[null,"Loudspeakers Quantity:"]
[null,"Select one design guide:",null,null,null,"Using Two VLF Steered Array Bracket"]
[null,null,null,24,{"$f":"IF(Z1=\"feet\",\"in\",IF(Z1=\"meter\",\"cm\",\"---\"))","v":"in"}]
[null,null,null,{"$f":"$C$32","v":84.608720044611815},"Hz"]
{"$rows_left_out":20}
{"sheet":"Calculator","index":1,"n_rows":92,"n_cols":28,"rows_kept":92,"cut":false,"hidden":false,"merged":[[19,3,19,5],[19,1,20,1],[19,7,20,7]]}
[null,null,null,null,null,null,null,null,null,null,null,null,null,null,null,null,null,null,null,null,null,null,null,null,null,"feet",null,0]
[null,null,null,null,null,null,null,null,null,null,null,null,null,null,null,null,null,null,null,null,null,null,null,null,null,5,null,{"$f":"AB1+15","v":15}]
[null,null,null,null,null,null,null,null,null,null,null,null,null,null,null,null,null,null,null,null,null,null,null,null,null,50,null,{"$f":"AB2+15","v":30}]
[null,null,null,null,null,null,null,null,null,null,null,null,null,null,null,null,null,null,null,null,null,null,null,null,null,6,null,45]
[null,null,null,null,null,null,null,null,null,null,null,null,null,null,null,null,null,null,null,null,null,null,null,null,null,1,null,60]
[null,null,null,null,null,null,null,null,null,null,null,null,null,null,null,null,null,null,null,null,null,null,null,null,null,null,"->empty",75]
[null,null,null,null,null,null,null,null,null,null,null,null,null,null,null,null,null,null,null,null,null,null,null,null,null,null,null,90]
[null,"2D Polar Prediction for Multiple Point Sources",null,null,null,null,null,null,null,null,null,null,null,null,null,null,null,null,null,null,null,null,null,null,null,null,null,105]
[null,"v1.3",null,null,null,null,null,null,null,null,null,null,null,null,null,null,null,null,null,null,null,null,null,null,null,null,null,120]
[null,null,null,null,null,null,null,null,null,null,null,null,null,null,null,null,null,null,null,null,null,null,null,null,null,null,null,135]
[null,null,null,null,null,null,null,null,null,null,null,null,null,null,null,null,null,null,null,null,null,null,null,null,null,null,null,150]
[null,"Data Input",null,null,null,null,null,null,null,null,null,null,null,null,null,null,null,null,null,null,null,null,null,null,null,null,null,165]
[null,"Unit",null,null,null,null,null,"Calculation Accuracy",null,null,null,null,null,null,null,null,null,null,null,null,null,null,null,null,null,null,null,180]
[null,"Speed of Sound (air propagation)",1128.116267261491,{"$f":"IF($Z$1=\"feet\",\"ft/s\", IF($Z$1=\"meters\", \"m/s\",\"--\"))","v":"ft/s"},null,null,null,"Polar Result Parameters:",null,null,null,null,null,null,null,null,null,null,null,null,null,null,null,null,null,null,null,195]
[null,"Distance to Listener/Microphone",40,{"$f":"Z1","v":"feet"},{"$f":"IF(C15=0,\"ERROR\",IF(AND(Z1=\"feet\", C15<15), \"Too close\", IF(AND(Z1=\"meters\",C15<5),\"Too close\",\"\")))","v":""},null,null,"Graph Range",null,null,null,null,null,{"$f":"Z3","v":50},"dB",null,null,null,null,null,null,null,null,null,null,null,null,210]
[null,"Point of Origin (X)",0,{"$f":"Z1","v":"feet"},{"$f":"IF($Z$1=\"feet\",$C$16*12, IF($Z$1=\"meters\", $C$16*100,\"--\"))","v":0},{"$f":"IF(Z1=\"feet\",\"inch(es)\",IF(Z1=\"meters\",\"cm\",\"--\"))","v":"inch(es)"},null,"Graph Scale",null,null,null,null,null,null,null,null,null,null,null,null,null,null,null,null,null,null,null,225]
[null,"Point of Origin (Y)",0,{"$f":"Z1","v":"feet"},{"$f":"IF($Z$1=\"feet\",$C$17*12, IF($Z$1=\"meters\", $C$17*100,\"--\"))","v":0},{"$f":"IF(Z1=\"feet\",\"inch(es)\",IF(Z1=\"meters\",\"cm\",\"--\"))","v":"inch(es)"},null,null,null,null,null,null,null,null,null,null,null,null,null,null,null,null,null,null,null,null,null,240]
[null,"Point of Origin (Z)",0,{"$f":"Z1","v":"feet"},{"$f":"IF($Z$1=\"feet\",$C$18*12, IF($Z$1=\"meters\", $C$18*100,\"--\"))","v":0},{"$f":"IF(Z1=\"feet\",\"inch(es)\",IF(Z1=\"meters\",\"cm\",\"--\"))","v":"inch(es)"},null,"Graph View/Polar Axis",null,null,null,null,null,null,null,null,null,null,null,null,null,null,null,null,null,null,null,255]
[null,null,null,null,null,null,null,null,null,null,null,null,null,null,null,null,null,null,null,null,null,null,null,null,null,null,null,{"$f":"AB18+15","v":270}]
[null,"Sound Sources","Phase shift",{"$f":"IF(Z1=\"feet\",\"Position (in)\",IF(Z1=\"meters\",\"Position (cm)\",\"--\"))","v":"Position (in)"},null,null,"Polarity","Delay (ms)","Attenuation",null,"Result",null,null,null,null,{"$f":"O32","v":"Y"},null,null,null,null,null,null,null,null,null,null,null,285]
{"$rows_left_out":73}
{"sheet":"Frequency Response","index":2,"n_rows":55,"n_cols":54,"rows_kept":55,"cut":false,"hidden":false,"merged":[]}
[null,null,null,null,null,null,null,null,null,null,null,null,null,null,null,null,null,null,null,null,null,null,null,null,null,true,null,null,null,null,null,null,null,null,null,null,null,null,null,null,null,null,null,null,null,null,null,null,null,null,null,null,null,20]
[null,null,null,null,null,null,null,null,null,null,null,null,null,null,null,null,null,null,null,null,null,null,null,null,null,2,null,null,null,null,null,null,null,null,null,null,null,null,null,null,null,null,null,null,null,null,null,null,null,null,null,null,null,20]
[]
[]
[]
[]
[]
[]
[]
[null,"Frequency and Phase Response Calculator"]
[null,"v1.3"]
[]
[null,"Note: This Spreadsheet utilized the data from 2D Polar Prediction for Multiple Point Sources spreadsheet"]
[]
[null,"Data Input"]
[null,"Listener Position (X)",30,{"$f":"Calculator!$Z$1","v":"feet"}]
[null,"Listener Position (Y)",0,{"$f":"Calculator!$Z$1","v":"feet"}]
[null,"Listener Position (Z)",0,{"$f":"Calculator!$Z$1","v":"feet"}]
[null,"Smoothing","NONE"]
[null,"Number of Samples",128]
{"$rows_left_out":36}
{"sheet":"Sine Wave","index":3,"n_rows":362,"n_cols":26,"rows_kept":362,"cut":false,"hidden":true,"merged":[]}
["Sine Wave Graph Tool",null,null,null,null,null,null,null,null,null,null,null,null,null,null,null,"Phase Shift (rad)",{"$f":"D5*(PI())/180","v":0},null,null,"X","Time","Y","Y2",null,"X axis"]
["Graph is limited to one period of the wave",null,null,null,null,null,null,null,null,null,null,null,null,null,null,null,"Periode (ms)",{"$f":"1/D4","v":0.01},null,null,0,{"$f":"(U2/360)*R$2","v":0},{"$f":"SIN((((2*PI())*$D$4)*($V2-($D$6/1000)))+$R$1)","v":0},{"$f":"SIN((((2*PI())*$F$4)*($V2-($F$6/1000)))+$R$3)","v":0},null,{"$f":"1000*($U2/360)*$R$2","v":0}]
["Fill in the green boxes",null,null,null,null,null,null,null,null,null,null,null,null,null,null,null,"Phase Shift (rad) #2",{"$f":"F5*(PI())/180","v":0},null,null,1,{"$f":"(U3/360)*R$2","v":2.7777777777777779E-5},{"$f":"SIN((((2*PI())*$D$4)*($V3-($D$6/1000)))+$R$1)","v":1.7452406437283512E-2},{"$f":"SIN((((2*PI())*$F$4)*($V3-($F$6/1000)))+$R$3)","v":1.7452406437283512E-2},null,{"$f":"1000*($U3/360)*$R$2","v":2.7777777777777776E-2}]
[null,null,"Frequency",100,"Hz",100,"Hz",null,null,null,null,null,null,null,null,null,"Periode (ms) #2",{"$f":"1/F4","v":0.01},null,null,{"$f":"U3+1","v":2},5.5555555555555558E-5,3.4899496702500969E-2,3.4899496702500969E-2,null,5.5555555555555552E-2]
[null,null,"Phase Shift",0,"deg",0,"deg",null,null,null,null,null,null,null,null,null,null,null,null,null,{"$f":"U4+1","v":3},8.3333333333333331E-5,5.2335956242943828E-2,5.2335956242943828E-2,null,8.3333333333333343E-2]
[null,null,"Delay",0,"ms",0,"ms",null,null,null,null,null,null,null,null,null,null,null,null,null,4,1.1111111111111112E-4,6.9756473744125302E-2,6.9756473744125302E-2,null,0.1111111111111111]
[null,null,null,1,null,2,null,null,null,null,null,null,null,null,null,null,null,null,null,null,5,1.3888888888888889E-4,8.7155742747658166E-2,8.7155742747658166E-2,null,0.13888888888888887]
[null,null,null,null,null,null,null,null,null,null,null,null,null,null,null,null,null,null,null,null,6,1.6666666666666666E-4,0.10452846326765346,0.10452846326765346,null,0.16666666666666669]
[null,null,"Note: Graph Axis is determined by the first sine wave input",null,null,null,null,null,null,null,null,null,null,null,null,null,null,null,null,null,7,1.9444444444444446E-4,0.12186934340514749,0.12186934340514749,null,0.19444444444444448]
[null,null,null,null,null,null,null,null,null,null,null,null,null,null,null,null,null,null,null,null,8,2.2222222222222223E-4,0.13917310096006544,0.13917310096006544,null,0.22222222222222221]
[null,null,null,null,null,null,null,null,null,null,null,null,null,null,null,null,null,null,null,null,9,2.5000000000000001E-4,0.15643446504023087,0.15643446504023087,null,0.25]
[null,null,null,null,null,null,null,null,null,null,null,null,null,null,null,null,null,null,null,null,10,2.7777777777777778E-4,0.17364817766693033,0.17364817766693033,null,0.27777777777777773]
[null,null,null,null,null,null,null,null,null,null,null,null,null,null,null,null,null,null,null,null,11,3.0555555555555555E-4,0.1908089953765448,0.1908089953765448,null,0.30555555555555552]
[null,null,null,null,null,null,null,null,null,null,null,null,null,null,null,null,null,null,null,null,12,3.3333333333333332E-4,0.20791169081775931,0.20791169081775931,null,0.33333333333333337]
[null,null,null,null,null,null,null,null,null,null,null,null,null,null,null,null,null,null,null,null,13,3.6111111111111109E-4,0.22495105434386498,0.22495105434386498,null,0.3611111111111111]
[null,null,null,null,null,null,null,null,null,null,null,null,null,null,null,null,null,null,null,null,14,3.8888888888888892E-4,0.24192189559966776,0.24192189559966776,null,0.38888888888888895]
[null,null,null,null,null,null,null,null,null,null,null,null,null,null,null,null,null,null,null,null,15,4.1666666666666664E-4,0.25881904510252074,0.25881904510252074,null,0.41666666666666663]
[null,null,null,null,null,null,null,null,null,null,null,null,null,null,null,null,null,null,null,null,16,4.4444444444444447E-4,0.27563735581699916,0.27563735581699916,null,0.44444444444444442]
[null,null,null,null,null,null,null,null,null,null,null,null,null,null,null,null,null,null,null,null,17,4.7222222222222224E-4,0.29237170472273677,0.29237170472273677,null,0.47222222222222221]
[null,null,null,null,null,null,null,null,null,null,null,null,null,null,null,null,null,null,null,null,18,5.0000000000000001E-4,0.3090169943749474,0.3090169943749474,null,0.5]
{"$rows_left_out":343}
{"sheet":"c","index":4,"n_rows":1095,"n_cols":32,"rows_kept":1095,"cut":false,"hidden":true,"merged":[[0,18,0,20]]}
["circle engine",null,null,null,null,null,null,null,"Programming notes",null,null,null,null,null,null,"No.","Sound Sources","Phase shift",{"$f":"IF(Calculator!Z1=\"feet\",\"pos-feet\",IF(Calculator!Z1=\"meters\",\"pos-meters\",\"--\"))","v":"pos-feet"},null,null,"Polarity","Delay (s)","Attenuation",null,null,"Freq","Amp","Phase"]
["point of origin",null,null,null,null,null,null,null,null,null,null,null,null,null,null,null,null,"(rad)","x","y","z","+/-"]
["a",{"$f":"Calculator!$C$16","v":0},null,"frequency",{"$f":"Calculator!$C$34","v":100},null,null,null,"# of calculated angle",null,null,{"$f":"360/$B$6","v":72},null,null,null,1,0,{"$f":"RADIANS(Calculator!$C22)","v":0},{"$f":"IF(Calculator!$Z$1=\"feet\",Calculator!D22/12,IF(Calculator!$Z$1=\"meters\",Calculator!D22/100,\"--\"))","v":0},{"$f":"IF(Calculator!$Z$1=\"feet\",Calculator!E22/12,IF(Calculator!$Z$1=\"meters\",Calculator!E22/100,\"--\"))","v":0},{"$f":"IF(Calculator!$Z$1=\"feet\",Calculator!F22/12,IF(Calculator!$Z$1=\"meters\",Calculator!F22/100,\"--\"))","v":0},1,{"$f":"Calculator!H22*(1/1000)","v":0},{"$f":"10^(ABS(Calculator!I22)/20)","v":1}]
["b",{"$f":"Calculator!$C$17","v":0},null,null,null,null,null,null,"Pi value",null,null,{"$f":"PI()","v":3.1415926535897931},null,null,null,2,0,{"$f":"RADIANS(Calculator!$C23)","v":0},{"$f":"IF(Calculator!$Z$1=\"feet\",Calculator!D23/12,IF(Calculator!$Z$1=\"meters\",Calculator!D23/100,\"--\"))","v":0},{"$f":"IF(Calculator!$Z$1=\"feet\",Calculator!E23/12,IF(Calculator!$Z$1=\"meters\",Calculator!E23/100,\"--\"))","v":0},{"$f":"IF(Calculator!$Z$1=\"feet\",Calculator!F23/12,IF(Calculator!$Z$1=\"meters\",Calculator!F23/100,\"--\"))","v":0},1,{"$f":"Calculator!H23*(1/1000)","v":0},{"$f":"10^(ABS(Calculator!I23)/20)","v":1}]
["radius",{"$f":"Calculator!$C$15","v":40},null,null,null,null,null,null,null,null,null,null,null,null,null,3,0,{"$f":"RADIANS(Calculator!$C24)","v":0},{"$f":"IF(Calculator!$Z$1=\"feet\",Calculator!D24/12,IF(Calculator!$Z$1=\"meters\",Calculator!D24/100,\"--\"))","v":0},{"$f":"IF(Calculator!$Z$1=\"feet\",Calculator!E24/12,IF(Calculator!$Z$1=\"meters\",Calculator!E24/100,\"--\"))","v":0},{"$f":"IF(Calculator!$Z$1=\"feet\",Calculator!F24/12,IF(Calculator!$Z$1=\"meters\",Calculator!F24/100,\"--\"))","v":0},1,{"$f":"Calculator!H24*(1/1000)","v":0},{"$f":"10^(ABS(Calculator!I24)/20)","v":1}]
["angle",{"$f":"Calculator!$Z$2","v":5},"deg",null,null,null,null,null,null,null,null,null,null,null,null,4,0,{"$f":"RADIANS(Calculator!$C25)","v":0},{"$f":"IF(Calculator!$Z$1=\"feet\",Calculator!D25/12,IF(Calculator!$Z$1=\"meters\",Calculator!D25/100,\"--\"))","v":0},{"$f":"IF(Calculator!$Z$1=\"feet\",Calculator!E25/12,IF(Calculator!$Z$1=\"meters\",Calculator!E25/100,\"--\"))","v":0},{"$f":"IF(Calculator!$Z$1=\"feet\",Calculator!F25/12,IF(Calculator!$Z$1=\"meters\",Calculator!F25/100,\"--\"))","v":0},1,{"$f":"Calculator!H25*(1/1000)","v":0},{"$f":"10^(ABS(Calculator!I25)/20)","v":1}]
["c",{"$f":"Calculator!$C$18","v":0},null,null,null,null,null,null,null,null,null,null,null,null,null,5,0,{"$f":"RADIANS(Calculator!$C26)","v":0},{"$f":"IF(Calculator!$Z$1=\"feet\",Calculator!D26/12,IF(Calculator!$Z$1=\"meters\",Calculator!D26/100,\"--\"))","v":0},{"$f":"IF(Calculator!$Z$1=\"feet\",Calculator!E26/12,IF(Calculator!$Z$1=\"meters\",Calculator!E26/100,\"--\"))","v":0},{"$f":"IF(Calculator!$Z$1=\"feet\",Calculator!F26/12,IF(Calculator!$Z$1=\"meters\",Calculator!F26/100,\"--\"))","v":0},1,{"$f":"Calculator!H26*(1/1000)","v":0},{"$f":"10^(ABS(Calculator!I26)/20)","v":1}]
["speed",{"$f":"Calculator!C14","v":1128.116267261491},null,null,null,null,null,null,null,null,null,null,null,null,null,6,0,{"$f":"RADIANS(Calculator!$C27)","v":0},{"$f":"IF(Calculator!$Z$1=\"feet\",Calculator!D27/12,IF(Calculator!$Z$1=\"meters\",Calculator!D27/100,\"--\"))","v":0},{"$f":"IF(Calculator!$Z$1=\"feet\",Calculator!E27/12,IF(Calculator!$Z$1=\"meters\",Calculator!E27/100,\"--\"))","v":0},{"$f":"IF(Calculator!$Z$1=\"feet\",Calculator!F27/12,IF(Calculator!$Z$1=\"meters\",Calculator!F27/100,\"--\"))","v":0},1,{"$f":"Calculator!H27*(1/1000)","v":0},{"$f":"10^(ABS(Calculator!I27)/20)","v":1}]
["Distance position",null,null,null,null,null,null,null,null,null,null,null,null,null,null,7,0,{"$f":"RADIANS(Calculator!$C28)","v":0},{"$f":"IF(Calculator!$Z$1=\"feet\",Calculator!D28/12,IF(Calculator!$Z$1=\"meters\",Calculator!D28/100,\"--\"))","v":0},{"$f":"IF(Calculator!$Z$1=\"feet\",Calculator!E28/12,IF(Calculator!$Z$1=\"meters\",Calculator!E28/100,\"--\"))","v":0},{"$f":"IF(Calculator!$Z$1=\"feet\",Calculator!F28/12,IF(Calculator!$Z$1=\"meters\",Calculator!F28/100,\"--\"))","v":0},1,{"$f":"Calculator!H28*(1/1000)","v":0},{"$f":"10^(ABS(Calculator!I28)/20)","v":1}]
["angle","x","y","z","Amplitude squared","Log Amplitude","Normalized","Ref Distance","bandmin","bandcen","bandmax","average","squared","Log amp",null,8,0,{"$f":"RADIANS(Calculator!$C29)","v":0},{"$f":"IF(Calculator!$Z$1=\"feet\",Calculator!D29/12,IF(Calculator!$Z$1=\"meters\",Calculator!D29/100,\"--\"))","v":0},{"$f":"IF(Calculator!$Z$1=\"feet\",Calculator!E29/12,IF(Calculator!$Z$1=\"meters\",Calculator!E29/100,\"--\"))","v":0},{"$f":"IF(Calculator!$Z$1=\"feet\",Calculator!F29/12,IF(Calculator!$Z$1=\"meters\",Calculator!F29/100,\"--\"))","v":0},1,{"$f":"Calculator!H29*(1/1000)","v":0},{"$f":"10^(ABS(Calculator!I29)/20)","v":1},null,null,null,null,null,null,null,"AF10-AK10 are reserved!!"]
[null,null,null,null,null,null,null,null,null,null,null,{"$f":"AVERAGE(I11:K11)","v":{"$error":"#DIV/0!"}},{"$f":"L11^2","v":{"$error":"#DIV/0!"}},{"$f":"IF(M11<>0,5*LOG10(M11),-1000)","v":{"$error":"#DIV/0!"}},null,9,0,{"$f":"RADIANS(Calculator!$C30)","v":0},{"$f":"IF(Calculator!$Z$1=\"feet\",Calculator!D30/12,IF(Calculator!$Z$1=\"meters\",Calculator!D30/100,\"--\"))","v":0},{"$f":"IF(Calculator!$Z$1=\"feet\",Calculator!E30/12,IF(Calculator!$Z$1=\"meters\",Calculator!E30/100,\"--\"))","v":0},{"$f":"IF(Calculator!$Z$1=\"feet\",Calculator!F30/12,IF(Calculator!$Z$1=\"meters\",Calculator!F30/100,\"--\"))","v":0},1,{"$f":"Calculator!H30*(1/1000)","v":0},{"$f":"10^(ABS(Calculator!I30)/20)","v":1}]
[null,null,null,null,null,null,null,null,null,null,null,{"$f":"AVERAGE(I12:K12)","v":{"$error":"#DIV/0!"}},{"$f":"L12^2","v":{"$error":"#DIV/0!"}},{"$f":"IF(M12<>0,5*LOG10(M12),-1000)","v":{"$error":"#DIV/0!"}},null,10,0,{"$f":"RADIANS(Calculator!$C31)","v":0},{"$f":"IF(Calculator!$Z$1=\"feet\",Calculator!D31/12,IF(Calculator!$Z$1=\"meters\",Calculator!D31/100,\"--\"))","v":0},{"$f":"IF(Calculator!$Z$1=\"feet\",Calculator!E31/12,IF(Calculator!$Z$1=\"meters\",Calculator!E31/100,\"--\"))","v":0},{"$f":"IF(Calculator!$Z$1=\"feet\",Calculator!F31/12,IF(Calculator!$Z$1=\"meters\",Calculator!F31/100,\"--\"))","v":0},1,{"$f":"Calculator!H31*(1/1000)","v":0},{"$f":"10^(ABS(Calculator!I31)/20)","v":1}]
[null,null,null,null,null,null,null,null,null,null,null,{"$error":"#DIV/0!"},{"$error":"#DIV/0!"},{"$error":"#DIV/0!"}]
[null,null,null,null,null,null,null,null,null,null,null,{"$error":"#DIV/0!"},{"$error":"#DIV/0!"},{"$error":"#DIV/0!"}]
[null,null,null,null,null,null,null,null,null,null,null,{"$error":"#DIV/0!"},{"$error":"#DIV/0!"},{"$error":"#DIV/0!"}]
[null,null,null,null,null,null,null,null,null,null,null,{"$error":"#DIV/0!"},{"$error":"#DIV/0!"},{"$error":"#DIV/0!"}]
[null,null,null,null,null,null,null,null,null,null,null,{"$error":"#DIV/0!"},{"$error":"#DIV/0!"},{"$error":"#DIV/0!"}]
[null,null,null,null,null,null,null,null,null,null,null,{"$error":"#DIV/0!"},{"$error":"#DIV/0!"},{"$error":"#DIV/0!"}]
[null,null,null,null,null,null,null,null,null,null,null,{"$error":"#DIV/0!"},{"$error":"#DIV/0!"},{"$error":"#DIV/0!"}]
[null,null,null,null,null,null,null,null,null,null,null,{"$error":"#DIV/0!"},{"$error":"#DIV/0!"},{"$error":"#DIV/0!"}]
{"$rows_left_out":1076}
{"sheet":"Notes and Instructions","index":5,"n_rows":342,"n_cols":3,"rows_kept":342,"cut":false,"hidden":false,"merged":[]}
[]
[]
[]
[]
[]
[]
[]
[]
[]
[]
[null,"S u b w o o f e r   S t e e r in g   S i m u l a t i o n   S o f t w a r e"]
[null,"v1.3"]
[]
[]
[null,"Requirements"]
[null,"*","Microsoft Excel 2003 and/or 2007 (PC version)"]
[null,"*","Active content/macro has to be enabled"]
[null,null,"Excel 2003 users can activate this feature with Tools Menu > Macro > Security > (low)"]
[null,null,"Excel 2007 users will be prompted to activate the active content upon opening"]
[]
{"$rows_left_out":323}
{"sheet":"Info","index":6,"n_rows":137,"n_cols":39,"rows_kept":137,"cut":false,"hidden":false,"merged":[[134,1,134,3],[135,1,135,3],[136,1,136,3],[28,21,42,26],[13,9,27,14],[13,15,27,20],[13,21,27,26],[73,21,87,26],[43,1,57,8],[43,9,57,14],[43,15,57,20],[43,21,57,26],[58,1,72,8],[58,9,72,14],[58,15,72,20],[58,21,72,26],[13,38,19,38],[21,38,26,38],[10,28,10,38],[11,28,11,38],[12,28,12,38],[10,27,11,27],[10,9,10,26],[11,9,11,26],[12,9,12,14],[12,15,12,20],[12,21,12,26],[9,1,9,4],[88,1,88,4],[73,1,87,8],[73,9,87,14],[73,15,87,20],[28,1,42,8],[28,9,42,14],[28,15,42,20],[10,1,12,8],[13,1,27,8],[81,38,86,38],[73,38,79,38],[43,38,49,38],[51,38,56,38],[28,38,34,38],[36,38,41,38],[58,38,64,38],[65,38,70,38]]}
[]
[]
[]
[]
[]
[]
[]
[null,"Informational Article"]
[]
[null,"Notes and Instructions"]
[null,"Subwoofer Placement & Setup",null,null,null,null,null,null,null,"Polar Pattern",null,null,null,null,null,null,null,null,null,null,null,null,null,null,null,null,null,"Stage-Audience","Frequency Response"]
[null,null,null,null,null,null,null,null,null,"(Freespace without Boundary Loading)",null,null,null,null,null,null,null,null,null,null,null,null,null,null,null,null,null,null,"Red - Frequency Response Prediction in the Audience Area"]
[null,null,null,null,null,null,null,null,null,"50Hz",null,null,null,null,null,"80Hz",null,null,null,null,null,"110Hz",null,null,null,null,null,"Orientation","Blue - Frequency Response Prediction on the Stage"]
[null,null,null,null,null,null,null,null,null,null,null,null,null,null,null,null,null,null,null,null,null,null,null,null,null,null,null,null,null,null,null,null,null,null,null,null,null,null,"Red - 50ft away from the stage"]
[]
[]
[]
[]
[null,null,null,null,null,null,null,null,null,null,null,null,null,null,null,null,null,null,null,null,null,null,null,null,null,null,null,"Ceiling"]
[null,null,null,null,null,null,null,null,null,null,null,null,null,null,null,null,null,null,null,null,null,null,null,null,null,null,null,"Stage"]
{"$rows_left_out":117}